{"text_format":"1","workbook":"xlsx","n_sheets":42,"sheets":["Istruzioni","Inserimento","Coltura","Gruppo","A","Standard","MAS","Valori da riportare","Bilancio","Scheda_N","Scheda_PK","Distribuz","Registra_Piano","Apporti al terreno","Cicli_Fase","C_tempo","Metodo","Ciclo_Modalità","Concimi","Mod_distribuz","Cicli","Suolo","Ragg_Tes","CN","B","C&D","E","F","Fert_org","G","Efficienza","Tipo_Fert","Gri_P","Gri_K","Calcare","pH","Codici","Work","TRI1","TRI2","TRI3","SO"],"not_rendered":{"charts":0,"images":1,"macros":1,"external_links":0,"defined_names":15,"comments":0,"pivot_tables":0},"unopened":[],"bounds":{"document_bytes":16777216,"sheet_cells":100000,"rows_first":2000,"rows_last":500,"rows_between":2000,"halvings":0,"cell_chars":16384,"cell_head_chars":4096},"cells_cut":0,"cells_raw":0,"read":"whole","date_system":"1900"}

{"sheet":"Istruzioni","index":0,"n_rows":38,"n_cols":9,"rows_kept":38,"cut":false,"hidden":false,"merged":[[18,0,18,8],[14,0,14,8],[16,0,16,8],[10,0,10,8],[2,0,2,8],[4,0,4,8],[6,0,6,8],[8,0,8,8],[12,0,12,8],[20,0,20,8],[22,0,22,8],[27,0,27,8],[37,0,37,8],[31,0,31,8],[35,0,35,8],[24,0,25,8],[29,0,29,8]]}
["Istruzione per l’uso dell’applicativo “Fert_Office_v1_19”",null,null,null,null,null,"Febbraio_2019",null,"senza logo"]
[]
["Il  “Fert_Office_v1_19”   è un applicativo in Excel per predisporre il piano di fertilizzazione."]
[]
["Vengono seguiti i criteri e le norme fissate nei Disciplinari di Produzione dell'Emilia Romagna Versione 2019."]
[]
["Sono presenti diversi fogli di lavoro,  di cui solo alcuni visibili, quelli nascosti non devono essere compilati e contengono i dati di base per effettuare i calcoli. I dati devono essere inseriti solo nelle celle di colore giallo.Per alcune variabili è prevista  la selezione da elenchi predefiniti. "]
[]
["Il primo foglio che bisogna utilizzare è “Inserimento”  dove devono essere digitate e selezionate le informazioni di base. "]
[]
["L’elenco delle colture, raccolte in ordine alfabetico, è suddiviso in 6 gruppi (prima le arboree, seguite da: erbacee, foraggere, orticole, colture  da seme e baby life);Per alcune sono previste diverse dizioni in funzione del tipo di parte asportata dal campo [es. solo granella (grano tenero granella); o granella+paglia (grano tenero pianta intera)]. Per alcune colture esistono divese categorie es. nel  grano tenero ci sono  le categorie delle varietà \"biscottiere\", \"panificabili :FP/FPS\" e di \"forza: FF\")."]
[]
["Dopo aver scelto la coltura occorre selezionare il periodo stagionale in cui si svolge il ciclo colturale (emergenza raccolta)  e la sua  durata presunta in giorni. "]
[]
["Nell'inserimento dei dati occorre tenere presente che in relazione alla coltura possono  variare le informazioni richieste."]
[]
["Fare attenzione che la  forma chimica  del fosforo e potassio selezionata sia quella corretta."]
[]
["Se i dati di CSC e Mg non sono disponibili lasciare le relative caselle vuote o con valore 0."]
[]
["Solo per le colture pluriennali in fase di impianto può essere indicata la durata prevista per potere calcolare le future asportazioni complessive di fosforo e potassio."]
[]
["Nella parte che riguarda eventuali apporti  organici alla coltura in precessione nel caso di apporti regolari occorre  inserire la quantità annua mediamente apportata di azoto. "]
[]
["Una volta inseriti i dati, per sapere quali siano le quantità di N, P2O5 e K2O da apportare è possibile consultare i foglio  “BILANCIO” per il  piano analitico o i fogli  \"Scheda_N\", \"Scheda_PK\" per il modello semplificato a dose Standard."]
[]
[]
["Il foglio \"Distribuz\" serve per programmare la distribuzione dei fertilizzanti scegliendo i  tipi, le quantità e  le epoche"]
[]
["Il piano di distribuzione dei fertilizzanti può essere copiato nel foglio \"Registra_Piano\" ed essere stampato ed utilizzato anche come scheda di registrazione delle distribuzioni."]
[]
["Nei fogli \"Apporti al terreno\" e \"Registra Piano\" è possibile controllare quale dovrebbe essere la dotazione in P2O5 e K2O nel terreno alla fine del ciclo colturale se si sono apportati i concimi indicati nel foglio distribuzione."]
[]
["Come carattere per la separazione dei decimali usare la virgola."]
[]
["Se nella selezione delle finestre a tendina, si verificano degli errori, ripetere la selezione passando dalla prima voce in elenco."]
[]
["Per eventuali chiarimenti, segnalazione di errori o consigli di miglioramenti contattare il Dr. Giuseppe Carnevali tel. 051 527 4615; giuseppe.carnevali@regione.emilia-romagna.it"]

{"sheet":"Inserimento","index":1,"n_rows":37,"n_cols":24,"rows_kept":37,"cut":false,"hidden":false,"merged":[[34,1,34,4],[34,7,36,23],[36,1,36,2],[22,12,22,13],[20,5,20,7],[20,9,20,10],[30,18,30,19],[31,18,31,19],[26,4,26,5],[35,1,35,2],[22,9,22,10],[30,12,30,14],[30,7,30,10],[29,7,29,16],[26,9,26,10],[25,9,25,10],[3,1,3,5],[18,12,18,13],[29,18,29,19],[11,10,14,11],[12,17,14,17],[4,7,4,11],[12,19,12,22],[3,22,4,23],[18,5,18,7],[18,9,18,10],[3,16,3,17],[4,16,4,17],[4,13,4,14],[3,7,3,11],[3,13,3,14],[12,1,12,2],[11,1,11,3],[24,4,24,5],[4,1,4,5],[20,12,20,13],[7,13,7,17],[7,5,7,11],[11,13,11,17],[22,6,22,7],[24,7,24,8],[17,17,17,23],[22,21,25,22],[25,18,25,19],[18,18,18,19],[22,18,22,19],[7,19,7,21],[7,1,7,2],[18,15,18,16],[22,15,22,16],[23,15,23,16],[25,15,25,16],[25,12,25,13],[19,15,19,16],[20,15,20,16]]}
[null,"Piano di fertilizzazione",null,null,null,null,null,null,null,null,null,null,null,"Scheda inserimento dati"]
[null,"Norme di riferimento DPI 2019"]
[null,"Dati aziendali e scelta del metodo di calcolo"]
[null,"Nome azienda",null,null,null,null,null,"Zona Vunerabile ai Nitrati",null,null,null,null,null,"Area omogenea",null,null,"Appezzamento",null,null,"Anno",null,"Metodo scelto",{"$f":"IF(AND(Codici!E2=1,A!G228=\"no\"),\"Metodo non previsto per questa coltura\",IF(AND(Standard!F233=\"nd\",Codici!E2=2),\"Non disponibile\",\" \"))","v":" "}]
[null,"Pinco Pallino",null,null,null,null,null,null,null,null,null,null,null,"A",null,null,1,null,null,2019]
[]
[null,"Dati della coltura e ubicazione"]
[null,"Gruppo",null,null,null,"Coltura",null,null,null,null,null,null,null,"Fase / Ciclo",null,null,null,null,null,"Resa annua (t/ha)",null,null,null,"Raccolta"]
[null,null,null,null,null,null,null,null,null,null,null,null,null,null,null,null,null,null,null,"prevista",null,"proposta",null,"n° tagli"]
[null,null,null,null,null,null,null,null,null,null,null,null,null,null,null,null,null,null,null,4,null,{"$f":"Standard!E237","v":4},null,2]
[]
[null,"Colture pluriennali",null,null,null,null,null,"Colture leguminose",null,null,{"$f":"IF(AND(J15>0,Coltura!E225=0),\"Non valorizzato perché non  pertinente (coltura senza azoto fissazione)\",\" \")","v":" "},null,null,"Modalità di coltivazione"]
[null,"Anticipazioni P e K (sì/no)",null,null,null,null,null,"% di azoto fissazione",null,null,null,null,null,null,null,null,null,{"$f":"Coltura!G228","v":" "},null,"Ubicazione"]
[null,"Durata (anni)",20,null,null,null,null,"proposta",null,"considerata"]
[null,"Resa media (t/ha)",35,null,null,null,null,{"$f":"Coltura!E225","v":0},null,0]
[]
[null,"Caratteristiche del suolo"]
[null,null,null,null,null,null,null,null,null,null,null,null,null,null,null,null,null,{"$f":"IF(Gri_K!$K$36=\"sì\",\" dotazione di K corretta in funzione del rapporto Mg/K e della CSC\",\" \")","v":" "}]
[null,"Sabbia %",10,null,"Classe",{"$f":"Suolo!E27","v":"FLA"},null,null,null,"N (g/kg)",null,0.9,{"$f":"B!F29","v":"Bassa"},null,null,"Potassio",null,385,{"$f":"Gri_K!G18","v":"elevata"},null,null,"Rapporto Mg/K",{"$f":"IF(Gri_K!R11=0,\" \",Gri_K!S14)","v":" "},{"$f":"Gri_K!T25","v":"non calcolato"}]
[null,null,null,null,null,null,null,null,null,null,null,null,null,null,null,"unità di misura",null,null,{"$f":"IF(OR(AND(Gri_K!M12=2,R19>1.5),(AND(Gri_K!M12=1,R19<30))),\"controlla valore e unità\",\" \")","v":" "}]
[null,"Argilla %",35,null,"Raggr.",{"$f":"Suolo!F19","v":"Argillosi e limosi"},null,null,null,"S.O. (%)",null,1.5,{"$f":"B!E19","v":"bassa"},null,null,"forma chimica",null,null,{"$f":"IF(AND(Gri_K!M7=1,Gri_K!M12=2),\"forma chimica errata\",\" \")","v":" "},null,null,"Rapporto K/CSC",{"$f":"IF(Gri_K!X10=0,\" \",Gri_K!O30)","v":" "},{"$f":"Gri_K!O39","v":"non calcolato"}]
[]
[null,"Limo %",{"$f":"(100-(C19+C21))","v":55},null,"pH",8.3000000000000007,{"$f":"pH!D12","v":"alcalino"},null,null,"C/N",null,{"$f":"((L21/1.724)/(L19/10))","v":9.6674400618716163},{"$f":"CN!D7","v":"equilibrato"},null,null,"Magnesio",null,null,{"$f":"Gri_K!Y22","v":"non valorizzato"},null,null,"Dotazione di K2O (ppm) presa a riferimento per il calcolo dei fabbisogni colturali"]
[null,null,null,null,null,null,null,null,null,null,null,null,null,null,null,"unità di misura",null,2.8,{"$f":"IF(S23=\"non valorizzato\",\" \",IF(OR(AND(Gri_K!Q7=2,R23>3.5),(AND(Gri_K!Q7=1,R23<30))),\"controlla valore e unità\",\" \"))","v":" "},null,null,null,null,{"$f":"Gri_K!G33","v":384.99845999999997}]
[null,"Disponibilità",null,null,"Calcare tot. (%)",null,16,{"$f":"Calcare!D12","v":"Mediamente calcareo"}]
[null,"ossigeno",null,null,null,null,null,null,null,"Fosforo (ppm)",null,41,{"$f":"Gri_P!F10","v":" molto elevata"},null,null,"C.S.C. (meq/100 g)",null,null,{"$f":"Gri_K!Y10","v":"non valorizzato"}]
[null,null,null,null,"Calcare att. (%)",null,9,{"$f":"Calcare!D26","v":"Molto elevato"},null,"forma chimica",null,null,null,null,null,null,"Se i dati di CSC e Mg non sono disponibili lasciare le relative caselle vuote o con valore 0."]
[]
[null,"Pratiche agronomiche"]
[null,null,"Precessione",null,null,null,null,"Fertilizzazioni organiche alle colture in precessione",null,null,null,null,null,null,null,null,null,null,"Semina su sodo",null,null,"Irriguo"]
[null,null,null,null,null,null,null,"Tipo fertilizzante",null,null,null,null,"Frequenza",null,null,null,"N (kg/ha)",null," (sì/no)",null,null," (sì/no)"]
[null,null,null,null,null,null,null,null,null,null,null,null,null,null,null,null,0]
[]
[null,"Andamento meteo",null,null,null,null,null,"Spazio per eventuali note"]
[null,"Precipitazioni in mm"]
[null,"dal 1/10 al 31/01",null,null,"in febbraio"]
[null,225.6,null,null,40]

{"sheet":"Coltura","index":2,"n_rows":228,"n_cols":13,"rows_kept":228,"cut":false,"hidden":true,"merged":[]}
["ordinato","progressivo di gruppo","ID_Coltura","coltura","N fissazione (%)","ID_Cic","coltivazione usuale","Limite N predefinito","Detrazione x semina su sodo","Genere","specie"]
[1,1,"A2","Actinidia polpa verde frutti, legno e foglie",0,"p","pieno campo",340,false,"Actinidia","chinensis","Conta numero colture X gruppo"]
[2,2,"Ab2","Actinidia polpa gialla frutti, legno e foglie",0,"p","pieno campo",340,false,"Actinidia","chinensis"]
[{"$f":"(A3+1)","v":3},{"$f":"(B3+1)","v":3},"A4","Albicocco media produzione frutti, legno e foglie",0,"p","pieno campo",340,false,"Prunus","armeniaca","Criterio","Numero"]
[{"$f":"(A4+1)","v":4},{"$f":"(B4+1)","v":4},"A5","Albicocco  alta produzione frutti, legno e foglie",0,"p","pieno campo",340,false,"Prunus","armeniaca","ID_Coltura"]
[5,5,"A6","Altri fruttiferi frutti, legno e foglie",0,"p","pieno campo",340,false,"Prunus","armeniaca","A*",{"$f":"DCOUNTA($A$1:$D$221,3,L5:L6)","v":30}]
[6,6,"A8","Arancio frutti, legno e foglie",0,"p","pieno campo",340,false,"Citrus","sinensis","ID_Coltura"]
[7,7,"A10","Castagno solo frutti",0,"p","pieno campo",340,false,"Castanea","sativa","E*",{"$f":"DCOUNTA($A$1:$D$221,3,L7:L8)","v":57}]
[8,8,"A12","Ciliegio frutti, legno e foglie",0,"p","pieno campo",340,false,"Prunus","avium","ID_Coltura"]
[9,9,"A14","Clementine frutti, legno e foglie",0,"p","pieno campo",340,false,null,null,"F*",{"$f":"DCOUNTA($A$1:$D$1221,3,L9:L10)","v":26}]
[10,10,"A16","Fico frutti, legno e foglie",0,"p","pieno campo",340,false,null,null,"ID_Coltura"]
[11,11,"A18","Kaki frutti, legno e foglie",0,"p","pieno campo",340,false,"Diospyros","kaki","O*",{"$f":"DCOUNTA($A$1:$D$1221,3,L11:L12)","v":74}]
[12,12,"A20","Limone frutti, legno e foglie",0,"p","pieno campo",340,false,null,null,"ID_Coltura"]
[13,13,"A22","Mandarino frutti, legno e foglie",0,"p","pieno campo",340,false,null,null,"S*",{"$f":"DCOUNTA($A$1:$D$1221,3,L13:L14)","v":23}]
[14,14,"A24","Mandorlo frutti, legno e foglie",0,"p","pieno campo",340,false,null,null,"ID_Coltura"]
[15,15,"A26","Melo frutti, legno e foglie",0,"p","pieno campo",340,false,"Malus","domestica","BL*",{"$f":"DCOUNTA($A$1:$D$1221,3,L15:L16)","v":12}]
[16,16,"A28","Nashi frutti, legno e foglie",0,"p","pieno campo",340,false]
[17,17,"A30","Nespolo frutti, legno e foglie",0,"p","pieno campo",340,false,null,null,"Modalità di coltivazione"]
[18,18,"A32","Nettarine frutti, legno e foglie",0,"p","pieno campo",340,false,null,null,1,"protetta"]
[19,19,"A34","Nocciolo frutti, legno e foglie",0,"p","pieno campo",340,false,"Corylus","avellana",2,"pieno campo"]
[20,20,"A36","Noce da frutto frutti, legno e foglie",0,"p","pieno campo",340,false,"Junglas","regia"]
[21,21,"A38","Olivo olive, legno e foglie",0,"p","pieno campo",340,false,"Olea ","europaea",{"$f":"Codici!I2","v":2},{"$f":"VLOOKUP(L22,L19:M20,2)","v":"pieno campo"}]
[22,22,"A40","Pero media produzione frutti, legno e foglie",0,"p","pieno campo",340,false,"Pirus ","communis"]
[23,23,"A41","Pero alta produzione frutti, legno e foglie",0,"p","pieno campo",340,false,"Pirus ","communis"]
[24,24,"A42","Pesco frutti, legno e foglie",0,"p","pieno campo",340,false,"Prunus","persica"]
[25,25,"A43","Pioppo",0,"p","pieno campo",340,false]
[26,26,"A44","Pioppo da energia",0,"p","pieno campo",340,false]
[27,27,"A46","Susino frutti, legno e foglie",0,"p","pieno campo",340,false,"Prunus","domestica"]
[28,28,"A48","Uva da tavola grappoli, tralci e foglie",0,"p","pieno campo",340,false]
[29,29,"A50","Vite per uva da vino (collina e montagna) grappoli, tralci e foglie ",0,"p","pieno campo",340,false,"Vitis","vinifera"]
[30,30,"A52","Vite per uva da vino (pianura) grappoli, legno e foglie",0,"p","pieno campo",340,false,"Vitis","vinifera"]
[31,1,"E1","Altri cereali a paglia (pianta intera)",0,"m","pieno campo",340,true]
[32,2,"E2","Avena",0,"m","pieno campo",340,true,"Avena","sativa"]
[33,3,"E3","Avena pianta intera",0,"m","pieno campo",340,true,"Avena","sativa"]
[34,4,"E4","Barbababietola da zucchero (pianta intera)",0,"m","pieno campo",340,false,"Beta","vulgaris var. saccarifera"]
[35,5,"E5","Barbabietola da zucchero  (radici)",0,"m","pieno campo",340,false,"Beta","vulgaris var. saccarifera"]
[36,6,"E6","Canapa da fibra",0,"m","pieno campo",340,false]
[37,7,"E7","Cavolo abissino",0,"m","pieno campo",340,false]
[38,8,"E8","Cece",50,"m","pieno campo",70,false,"Cicer","arietinum"]
[39,9,"E9","Colza",0,"m","pieno campo",340,false,"Brassica","napus"]
[40,10,"E10","Colza pianta intera",0,"m","pieno campo",340,false,"Brassica","napus"]
[41,11,"E11","Farro",0,"m","pieno campo",340,true,"Triticum","monococcum, dicoccum, spelta"]
[42,12,"E12","Farro (pianta intera)",0,"m","pieno campo",340,true,"Triticum","monococcum, dicoccum, spelta"]
[43,13,"E13","Favino da granella",85,"m","pieno campo",40,false,"Vicia","faba"]
[44,14,"E14","Girasole (acheni)",0,"m","pieno campo",340,true,"Heliantus","annuus"]
[45,15,"E15","Girasole (pianta intera)",0,"m","pieno campo",340,true,"Heliantus","annuus"]
[46,16,"E16","Grano duro (granella)",0,"m","pieno campo",340,true,"Triticum","durum"]
[47,17,"E17","Grano duro (pianta intera)",0,"m","pieno campo",340,true,"Triticum","durum"]
[48,18,"E18","Grano tenero FP/FPS (granella)",0,"m","pieno campo",340,true,"Triticum","aestivum"]
[49,19,"E19","Grano tenero FP/FPS (pianta intera)",0,"m","pieno campo",340,true,"Triticum","aestivum"]
[50,20,"E20","Grano tenero biscottiero  (granella)",0,"m","pieno campo",340,true,"Triticum","aestivum"]
[51,21,"E21","Grano tenero biscottiero pianta intera",0,"m","pieno campo",340,true,"Triticum","aestivum"]
[52,22,"E22","Grano tenero FF (granella)",0,"m","pieno campo",340,true,"Triticum","aestivum"]
[53,23,"E23","Grano tenero FF (pianta intera)",0,"m","pieno campo",340,true,"Triticum","aestivum"]
[54,24,"E24","Lenticchia",85,"m","pieno campo",30,false]
[55,25,"E25","Lino  fibra",0,"m","pieno campo",340,false]
[56,26,"E26","Lino granella",0,"m","pieno campo",340,false]
[57,27,"E27","Lupino",85,"m","pieno campo",340,false]
[58,28,"E28","Mais da granella 300-400 (granella)",0,"m","pieno campo",340,true,"Zea","mays"]
[59,29,"E29","Mais da granella 300-400 (pianta intera)",0,"m","pieno campo",340,true,"Zea","mays"]
[60,30,"E30","Mais da granella 500-700 (granella)",0,"m","pieno campo",340,true,"Zea","mays"]
[61,31,"E31","Mais da granella 500-700 (pianta intera)",0,"m","pieno campo",340,true,"Zea","mays"]
[62,32,"E32","Mais dolce  (spighe)",0,"m","pieno campo",340,false,"Zea","mays"]
[63,33,"E33","Mais dolce (pianta intera)",0,"m","pieno campo",340,false,"Zea","mays"]
[64,34,"E34","Mais trinciato classe 500",0,"m","pieno campo",340,true,"Zea","mays"]
[65,{"$f":"(B65+1)","v":35},"E35","Mais trinciato classe 700",0,"m","pieno campo",340,true,"Zea","mays"]
[66,{"$f":"(B66+1)","v":36},"E36","Orzo (granella)",0,"m","pieno campo",340,true,"Hordeum","vulgare"]
[67,37,"E37","Orzo (pianta intera)",0,"m","pieno campo",340,true,"Hordeum","vulgare"]
[{"$f":"(A68+1)","v":68},38,"E38","Panico",0,"m","pieno campo",340,false]
[69,39,"E39","Pisello proteico",85,"m","pieno campo",30,false,"Pisum","sativum"]
[70,40,"E40","Pisello proteico + residui",85,"m","pieno campo",30,false,"Pisum","sativum"]
[71,41,"E41","Rafano (da sovescio)",0,"m","pieno campo",340,false]
[72,42,"E42","Riso (granella)",0,"m","pieno campo",340,false,"Oryza","sativa"]
[73,43,"E43","Riso (granella+paglia)",0,"m","pieno campo",340,false,"Oryza","sativa"]
[74,44,"E44","Segale (granella)",0,"m","pieno campo",340,true,"Secale","cereale"]
[75,45,"E45","Segale pianta intera",0,"m","pieno campo",340,true,"Secale","cereale"]
[76,46,"E46","Senape indiana",0,"m","pieno campo",340,false,"Brassica","juncea"]
[77,47,"E47","Soia (granella)",90,"m","pieno campo",0,true,"Glicine","max"]
[78,48,"E48","Soia (pianta intera)",90,"m","pieno campo",0,true,"Glicine","max"]
[79,49,"E49","Sorgo da foraggio",0,"m","pieno campo",340,true,"Sorghum","bicolor,  ssp. sudanense"]
[80,50,"E50","Sorgo da granella  (solo granella)",0,"m","pieno campo",340,true,"Sorghum","bicolor,  ssp. bicolor"]
[81,51,"E51","Sorgo da granella (pianta intera)",0,"m","pieno campo",340,true,"Sorghum","bicolor,  ssp. bicolor"]
[82,52,"E52","Tabacco Bright",0,"m","pieno campo",340,false]
[83,53,"E53","Tabacco Bright pianta intera",0,"m","pieno campo",340,false]
[84,54,"E54","Tabacco Burley",0,"m","pieno campo",340,false]
[85,55,"E55","Tabacco Burley pianta intera",0,"m","pieno campo",340,false]
[86,56,"E56","Triticale",0,"m","pieno campo",340,true,"Triticosecale"]
[87,57,"E57","Triticale pianta intera",0,"m","pieno campo",340,true,"Triticosecale"]
[88,1,"F1","Avena insilata",0,"m","pieno campo",340,false,"Avena","sativa"]
[89,2,"F2","Colza insilato",0,"m","pieno campo",340,false]
[90,3,"F3","Erba mazzolina",0,"p","pieno campo",340,true]
[91,4,"F4","Erba medica",100,"p","pieno campo",0,false,"Medicago","sativa"]
[92,5,"F5","Erbai aut prim. Di cer. O cruc.",0,"m","pieno campo",340,true]
[93,6,"F6","Erbai aut prim. Di leguminose",50,"m","pieno campo",340,true]
[94,7,"F7","Erbai biennali o Prati avv. di Graminacee",0,"p","pieno campo",340,true]
[95,8,"F8","Erbai biennali misti o Prati avv. Polifita",0,"p","pieno campo",340,true]
[96,9,"F9","Farro insilato",0,"m","pieno campo",340,true]
[97,10,"F10","Festuca arundinacea",0,"p","pieno campo",340,true]
[98,11,"F11","Fleolo (coda di topo)",0,"p","pieno campo",340,true]
[99,12,"F12","Grano duro  insilato",0,"m","pieno campo",340,true]
[100,13,"F13","Grano tenero  insilato",0,"m","pieno campo",340,true]
[101,14,"F14","Loglio da insilare",0,"m","pieno campo",340,true]
[102,15,"F15","Loiessa",0,"m","pieno campo",340,true]
[103,16,"F16","Loietto perenne",0,"p","pieno campo",340,true]
[104,17,"F17","Orzo insilato",0,"m","pieno campo",340,true]
[105,18,"F18","Prati di graminacee",0,"p","pieno campo",340,false]
[106,19,"F19","Prati di trifoglio",50,"p","pieno campo",340,false]
[107,20,"F20","Prati pascoli in collina",0,"p","pieno campo",340,false]
[108,21,"F21","Prati polifiti >50% leguminose",30,"p","pieno campo",340,false]
[109,22,"F22","Prati polifiti",0,"p","pieno campo",340,false]
[110,23,"F23","Prati stabili in pianura",0,"p","pieno campo",340,false]
[111,24,"F24","Prato misto",0,"p","pieno campo",340,false]
[112,25,"F25","Segale insilato",0,"m","pieno campo",340,true]
[113,26,"F26","Triticale insilato",0,"m","pieno campo",340,true]
[114,1,{"$f":"_xlfn.CONCAT(\"O\",B115)","v":"O1"},"Aglio",0,"m","pieno campo",340,false,"Allium","sativum"]
[115,2,{"$f":"_xlfn.CONCAT(\"O\",B116)","v":"O2"},"Asparago verde (pianta intera)",0,"p","pieno campo",340,false,"Asparagus","officinalis"]
[116,3,"O3","Basilico media produzione",0,"m","pieno campo",340,false,"Ocimum","basilicum"]
[117,4,"O4","Basilico alta produzione più tagli",0,"m","pieno campo",340,false,"Ocimum","basilicum"]
[118,5,"O5","Bietola da costa e da foglia m. fresco  media produzione",0,"m","pieno campo",340,false,"Beta","vulgaris var. cycla"]
[119,6,"O6","Bietola da costa e da foglia m. fresco  alta produzione più tagli",0,"m","pieno campo",340,false,"Beta","vulgaris var. cycla"]
[120,7,"O7","Bietola da foglie per l'industria media produzione più tagli",0,"m","pieno campo",340,false,"Beta","vulgaris var. cycla"]
[121,8,"O8","Bietola da costa per l'industria alta produzione più tagli",0,"m","pieno campo",340,false,"Beta","vulgaris var. cycla"]
[122,9,"O9","Broccoletto  - Cime di rapa",0,"m","pieno campo",340,false,"Brassica","oleracea var. gongylodes"]
[123,10,"O10","Broccolo media produzione",0,"m","pieno campo",340,false,"Brassica","oleracea var. botrytis"]
[124,11,"O11","Broccolo alta produzione",0,"m","pieno campo",340,false,"Brassica","oleracea var. botrytis"]
[125,12,"O12","Cappuccio media produzione",0,"m","pieno campo",340,false,"Brassica","oleracea var. capitata"]
[126,13,"O13","Cappuccio alta produzione",0,"m","pieno campo",340,false,"Brassica","oleracea var. capitata"]
[127,14,"O14","Carciofo",0,"p","pieno campo",340,false]
[128,15,"O15","Cardo media produzione",0,"m","pieno campo",340,false,"Cynara","cardunculus"]
[129,16,"O16","Cardo alta produzione",0,"m","pieno campo",340,false]
[130,17,"O17","Carota",0,"m","pieno campo",340,false,"Daucus","carota"]
[131,18,"O18","Cavolfiore media produzione",0,"m","pieno campo",340,false,"Brassica","oleracea"]
[{"$f":"(A132+1)","v":132},19,"O19","Cavolfiore alta produzione",0,"m","pieno campo",340,false,"Brassica","oleracea"]
[133,20,"O20","Cavolo verza mercato media produzione",0,"m","pieno campo",340,false,"Brassica","oleracea"]
[134,21,"O21","Cavolo verza mercato alta produzione",0,"m","pieno campo",340,false,"Brassica","oleracea"]
[135,22,"O22","Cavolo Riccio, Cavolo nero e Cavolo Rapa",0,"m","pieno campo",340,false,"Brassica","oleracea"]
[136,23,"O23","Cetriolo da mensa media produzione",0,"m","pieno campo",340,false,"Cucumis","sativus"]
[137,24,"O24","Cetriolo da mensa alta produzione",0,"m","pieno campo",340,false,"Cucumis","sativus"]
[138,25,"O25","Cicoria da mercato media produzione",0,"m","pieno campo",340,false,"Cichorium","intybus"]
[139,26,"O26","Cicoria da mercato alta produzione",0,"m","pieno campo",340,false,"Cichorium","intybus var. foliosum"]
[140,27,"O27","Cicoria da industria alta produzione più tagli",0,"m","pieno campo",340,false,"Cichorium","intybus var. foliosum"]
[141,28,"O28","Cipolla",0,"m","pieno campo",340,false,"Allium","cepa"]
[142,29,"O29","Cocomero",0,"m","pieno campo",340,false,"Citrullus","lanatus"]
[143,30,"O30","Endivie (indivie riccia e scarola) media produzione",0,"m","pieno campo",340,false,"Cichorium","endivia"]
[144,31,"O31","Endivie (indivie riccia e scarola) alta produzione",0,"m","pieno campo",340,false,"Cichorium","endivia"]
[145,32,"O32","Fagiolino",75,"m","pieno campo",75,false,"Phaseolus","vulgaris"]
[146,33,"O33","Fagiolo in baccelli da sgranare",80,"m","pieno campo",75,false,"Phaseolus","vulgaris"]
[147,34,"O34","Fagiolo secco",80,"m","pieno campo",75,false,"Phaseolus","vulgaris"]
[148,35,"O35","Fava da consumo fresco",85,"m","pieno campo",40,false,"Vicia","faba var. major"]
[149,36,"O36","Finocchio",0,"m","pieno campo",340,false,"Foeniculum","vulgare"]
[150,37,"O37","Fragola ",0,"m","pieno campo",340,false,"Fragraria","F. chiloensis x  F. virginiana"]
[151,38,"O38","Lattuga",0,"m","pieno campo",340,false,"Lactuca","sativa"]
[152,39,"O39","Lattuga coltura protetta",0,"m","protetta",340,false,"Lactuca","sativa"]
[153,40,"O40","Melanzana in pieno campo media produzione",0,"m","protetta",340,false,"Solanum","melongena"]
[154,41,"O41","Melanzana coltura protetta alta produzione",0,"m","protetta",340,false,"Solanum","melongena"]
[155,42,"O42","Melone",0,"m","protetta",340,false,"Cucumis","melo"]
[156,43,"O43","Patata",0,"m","pieno campo",340,false,"Solanum","tuberosum"]
[157,44,"O44","Peperone in serra alta produzione",0,"m","protetta",340,false,"Capsicum","annuum"]
[158,45,"O45","Peperone in serra media produzione",0,"m","pieno campo",340,false,"Capsicum","annuum"]
[159,46,"O46","Piccoli frutti",0,"p","pieno campo",340,false]
[160,47,"O47","Pisello da industria (grani)",50,"m","pieno campo",70,false,"Pisum","sativum"]
[161,48,"O48","Pisello da mercato fresco (baccelli)",80,"m","pieno campo",70,false,"Pisum","sativum"]
[162,49,"O49","Pomodoro da industria media produzione",0,"m","pieno campo",340,false,"Solanum ","lycopersicum"]
[163,50,"O50","Pomodoro da industria alta produzione",0,"m","pieno campo",340,false,"Solanum ","lycopersicum"]
[164,51,"O51","Pomodoro da mensa a pieno campo",0,"m","pieno campo",340,false,"Solanum ","lycopersicum"]
[165,52,"O52","Pomodoro da mensa in serra",0,"m","protetta",340,false,"Solanum ","lycopersicum"]
[166,53,"O53","Porro",0,"m","pieno campo",340,false,"Allium","porrum"]
[167,54,"O54","Prezzemolo media produzione",0,"m","pieno campo",340,false,"Petroselinum","crispum"]
[168,55,"O55","Prezzemolo alta produzione più tagli",0,"m","pieno campo",340,false,"Petroselinum","crispum"]
[169,56,"O56","Radicchio (cicoria a foglie colorate) media produzione",0,"m","pieno campo",340,false,"Cichorium ","intybus var. foliosum"]
[170,57,"O57","Radicchio (cicoria a foglie colorate) alta produzione",0,"m","pieno campo",340,false]
[171,58,"O58","Rapa",0,"m","pieno campo",340,false,"Brassica","rapa"]
[172,59,"O59","Ravanello",0,"m","pieno campo",340,false,"Raphanus","sativus"]
[173,60,"O60","Rucola media produzione",0,"m","pieno campo",340,false,"Eruca","vesicaria - sativa"]
[174,61,"O61","Rucola alta produzione con più tagli",0,"m","pieno campo",340,false,"Eruca","vesicaria - sativa"]
[175,62,"O62","Scalogno",0,"m","pieno campo",340,false,"Allium","ascalonicum"]
[176,63,"O63","Sedano media produzione",0,"m","pieno campo",340,false,"Apium","graveolens"]
[177,64,"O64","Sedano alta produzione",0,"m","pieno campo",340,false,"Apium","graveolens"]
[178,65,"O65","Spinacio alta produzione con più tagli",0,"m","pieno campo",340,false,"Spinacia","oleracea"]
[179,66,{"$f":"_xlfn.CONCAT(\"O\",B180)","v":"O66"},"Spinacio media produzione",0,"m","pieno campo",340,false,"Spinacia","oleracea"]
[180,67,"O67","Verza - cavolo da mercato media produzione",0,"m","pieno campo",340,false,"Brassica","oleracea var. sabauda"]
[181,68,"O68","Verza - cavolo da mercato alta produzione",0,"m","pieno campo",340,false,"Brassica","oleracea var. sabauda"]
[182,69,"O69","Verza da industria",0,"m","pieno campo",340,false,"Brassica","oleracea var. sabauda"]
[183,70,"O70","Zucca",0,"m","pieno campo",340,false,"Cucurbita","maxima / moschata"]
[184,71,"O71","Zucchino da industria media produzione",0,"m","pieno campo",340,false,"Cucurbita","pepo"]
[185,72,"O72","Zucchino da industria alta produzione",0,"m","pieno campo",340,false,"Cucurbita","pepo"]
[186,73,"O73","Zucchino da mercato fresco media produzione",0,"m","protetta",340,false,"Cucurbita","pepo"]
[187,74,"O74","Zucchino da mercato  fresco alta produzione",0,"m","protetta",340,false,"Cucurbita","pepo"]
[188,1,"S1","Barbabiertola da seme (fase porta seme)",0,"m","pieno campo",340,false]
[189,2,"S2","Carota da seme (fase portaseme)",0,"m","pieno campo",340,false]
[190,3,"S3","Carota da seme (fase vivaio)",0,"m","pieno campo",340,false]
[191,4,"S4","Cavoli da seme",0,"m","pieno campo",340,false]
[192,5,"S5","Cetriolo da seme",0,"m","pieno campo",340,false]
[193,6,"S6","Cicoria da seme",0,"m","pieno campo",340,false]
[194,7,"S7","Cipolla da seme (fase portaseme)",0,"m","pieno campo",340,false]
[195,8,"S8","Cipolla da seme (fase vivaio)",0,"m","pieno campo",340,false]
[{"$f":"(A196+1)","v":196},9,"S9","Coriandolo da seme",0,"m","pieno campo",340,false,"Coriandrum","sativum"]
[197,10,"S10","Erba medica  da seme",100,"p","pieno campo",340,false,"Medicago","sativa"]
[198,11,"S11","Finocchio da seme",0,"m","pieno campo",340,false,"Foeniculum","vulgare"]
[199,12,"S12","Frumento duro da seme (granella)",0,"m","pieno campo",340,false,"Triticum","durum"]
[200,13,"S13","Frumento tenero da seme (granella)",0,"m","pieno campo",340,false,"Triticum","aestivum"]
[201,14,"S14","Girasole da seme (granella)",0,"m","pieno campo",340,false,"Heliantus","annuus"]
[202,15,"S15","Lattuga da seme",0,"m","pieno campo",340,false,"Lactuca","sativa"]
[203,16,"S16","Orzo da seme (granella)",0,"m","pieno campo",340,false,"Hordeum","vulgare"]
[204,17,"S17","Pisello proteico da seme (granella)",0,"m","pieno campo",80,false,"Pisum","sativum"]
[205,18,"S18","Prezzemolo da seme",0,"m","pieno campo",340,false,"Petroselinum","crispum"]
[206,19,"S19","Ravanello da seme",0,"m","pieno campo",340,false,"Raphanus","sativus"]
[207,20,"S20","Segale da seme (granella)",0,"m","pieno campo",340,false,"Secale","cereale"]
[208,21,"S21","Soia da seme (granella)",0,"m","pieno campo",0,false,"Glicine","max"]
[209,22,"S22","Triticale da seme (granella)",0,"m","pieno campo",340,true,"Triticosecale"]
[210,1,"BL1","Bietola da foglia",0,"c","pieno campo",340,false,"Beta","vulgaris var. cycla"]
[211,2,"BL2","Cicorino",0,"c","protetta",340,false,"Cichorium","intybus var. foliosum"]
[212,3,"BL3","Foglie e steli di Brassica",0,"c","protetta",340,false,"Brassica","oleracea"]
[213,4,"BL4","Lattuga da cespo",0,"c","protetta",340,false,"Lactuca","sativa"]
[214,5,"BL5","Lattughino 1° taglio",0,"c","protetta",340,false,"Lactuca","sativa"]
[215,6,"BL6","Lattughino 2° taglio",0,"c","protetta",340,false,"Lactuca","sativa"]
[216,7,"BL7","Rucola 1° taglio",0,"c","protetta",340,false,"Eruca","vesicaria - sativa"]
[217,8,"BL8","Rucola 2° taglio",0,"c","protetta",340,false,"Eruca","vesicaria - sativa"]
[218,9,"BL9","Spinacino 1° taglio",0,"c","protetta",340,false,"Spinacia","oleracea"]
[219,10,"BL10","Spinacino 2° taglio",1,"c","protetta",340,false,"Spinacia","oleracea"]
[220,11,"BL11","Valerianella",0,"c","protetta",340,false,"Valerianella","locusta"]
[221,12,"BL12","baby leaf generica",0,"c","protetta",340,false]
[]
["ordinato","progressivo di gruppo","ID_Coltura","Coltura attualmente selezionata","N fissazione (%)","ID_Cic","coltivazione usuale","Limite N predefinito","Detrazione x semina su sodo"]
[{"$f":"(Gruppo!F9+Codici!G2)","v":207},{"$f":"DGET($A$1:$E$222,2,$A$224:$A$225)","v":20},{"$f":"DGET($A$1:$E$222,3,$A$224:$A$225)","v":"S20"},{"$f":"DGET($A$1:$D$222,4,$A$224:$A$225)","v":"Segale da seme (granella)"},{"$f":"DGET($A$1:$E$222,5,$A$224:$A$225)","v":0},{"$f":"DGET($A$1:$F$222,6,$A$224:$A$225)","v":"m"},{"$f":"DGET($A$1:$G$222,7,$A$224:$A$225)","v":"pieno campo"},{"$f":"DGET($A$1:$H$222,8,$A$224:$A$225)","v":340},{"$f":"DGET($A$1:$I$222,9,$A$224:$A$225)","v":false}]
[null,null,null,null,null,null,"Usuale"]
[null,null,null,null,null,null,{"$f":"IF(G225=M22,TRUE,FALSE)","v":true}]
[null,null,null,null,{"$f":"IF(E225=0,\"Non pertinente, coltura senza azoto fissazione\", \" \")","v":"Non pertinente, coltura senza azoto fissazione"},null,{"$f":"IF(G227=TRUE,\" \",\"modalità non usuale\")","v":" "}]

{"sheet":"Gruppo","index":3,"n_rows":12,"n_cols":7,"rows_kept":12,"cut":false,"hidden":true,"merged":[]}
["Progressivo","ID_Gru","Gruppo","intervallo coltura","numero","ordinato parte dopo","Macro categoria"]
[1,"A","arboree","D2:D31",30,0,"arboree"]
[2,"E","erbacee","D32:D88",57,30,"erbacee"]
[3,"F","foraggere","D89:D114",26,87,"erbacee"]
[4,"O","orticole","D115:D188",74,113,"erbacee"]
[5,"S","da_seme","D189:D210",22,187,"erbacee"]
[6,"BL","baby_life","D211:D222",12,209,"erbacee"]
["Gruppo attualmente selezionato"]
[{"$f":"Codici!F2","v":5},{"$f":"VLOOKUP($A9,$A$2:$C$7,2)","v":"S"},{"$f":"VLOOKUP($A9,$A$2:$C$7,3)","v":"da_seme"},{"$f":"VLOOKUP($A9,$A$2:$D$7,4)","v":"D189:D210"},{"$f":"VLOOKUP($A9,$A$2:$H$7,5)","v":22},{"$f":"VLOOKUP($A9,$A$2:$H$7,6)","v":187},{"$f":"VLOOKUP($A9,$A$2:$H$7,7)","v":"erbacee"}]
[]
[null,null,null,"matrice"]
[null,null,null,{"$f":"CONCATENATE(\"Coltura\",\"!\",D9)","v":"Coltura!D189:D210"}]

{"sheet":"A","index":4,"n_rows":234,"n_cols":16,"rows_kept":234,"cut":false,"hidden":true,"merged":[[0,3,0,5],[232,4,232,5],[0,12,0,14],[1,9,1,10],[0,8,0,10]]}
["A (kg/ha):  Fabbisogni colturali",null,null,"coefficienti unitari",null,null,"Bilancio","resa (t)","Fabbisogni standard",null,null,"raccolto e asportato dal campo","Coeff. Stimati (%)"]
[null,null,null,"ass.","asp.","asp.",null,null,"assorbito","asportato"]
["ordinato","ID_Coltura","coltura","N","P2O5","K2O","(sì/no)","rif","N (kg)","P2O5 (kg)","K2O (kg)","parte","N","P2O5","K2O"]
[1,{"$f":"Coltura!C2","v":"A2"},{"$f":"Coltura!D2","v":"Actinidia polpa verde frutti, legno e foglie"},0.59,0.16,0.59,{"$f":"IF(AND(D4>0,E4>0,F4>0),\"sì\",\"no\")","v":"sì"},{"$f":"(Standard!E4)","v":25},{"$f":"(D4*$H4)*10","v":147.5},{"$f":"(E4*$H4)*10","v":40},{"$f":"(F4*$H4)*10","v":147.5},"frutti"]
[2,{"$f":"Coltura!C3","v":"Ab2"},{"$f":"Coltura!D3","v":"Actinidia polpa gialla frutti, legno e foglie"},0.59,0.16,0.59,{"$f":"IF(AND(D5>0,E5>0,F5>0),\"sì\",\"no\")","v":"sì"},{"$f":"(Standard!E5)","v":30},{"$f":"(D5*$H5)*10","v":177},{"$f":"(E5*$H5)*10","v":48},{"$f":"(F5*$H5)*10","v":177},"frutti"]
[{"$f":"(A5+1)","v":3},{"$f":"Coltura!C4","v":"A4"},{"$f":"Coltura!D4","v":"Albicocco media produzione frutti, legno e foglie"},0.55000000000000004,0.13,0.53,{"$f":"IF(AND(D6>0,E6>0,F6>0),\"sì\",\"no\")","v":"sì"},{"$f":"(Standard!E6)","v":13},71.5,16.899999999999999,68.900000000000006,"frutti"]
[{"$f":"(A6+1)","v":4},{"$f":"Coltura!C5","v":"A5"},{"$f":"Coltura!D5","v":"Albicocco  alta produzione frutti, legno e foglie"},0.55000000000000004,0.13,0.5,"sì",{"$f":"(Standard!E7)","v":18},{"$f":"(D7*$H7)*10","v":99},{"$f":"(E7*$H7)*10","v":23.4},{"$f":"(F7*$H7)*10","v":90},"frutti"]
[5,{"$f":"Coltura!C6","v":"A6"},{"$f":"Coltura!D6","v":"Altri fruttiferi frutti, legno e foglie"},0.33,{"$f":"N8","v":0.31583333333333335},{"$f":"O8","v":0.76333333333333331},"sì",{"$f":"(Standard!E8)","v":"nd"},null,null,null,"frutti",null,{"$f":"AVERAGE(E4:E6,E9:E18,E21:E27,E30:E33)","v":0.31583333333333335},{"$f":"AVERAGE(F4:F6,F9:F18,F21:F27,F30:F33)","v":0.76333333333333331}]
[6,{"$f":"Coltura!C7","v":"A8"},{"$f":"Coltura!D7","v":"Arancio frutti, legno e foglie"},0.28000000000000003,0.13,0.39,"sì",{"$f":"(Standard!E9)","v":30},84,39,117.00000000000001,"frutti"]
[7,{"$f":"Coltura!C8","v":"A10"},{"$f":"Coltura!D8","v":"Castagno solo frutti"},0.84,0.33,0.86,"sì",{"$f":"(Standard!E10)","v":"nd"},null,null,null,"frutti"]
[8,{"$f":"Coltura!C9","v":"A12"},{"$f":"Coltura!D9","v":"Ciliegio frutti, legno e foglie"},0.67,0.22,0.59,"sì",{"$f":"(Standard!E11)","v":9},60.300000000000004,19.8,53.099999999999994,"frutti"]
[9,{"$f":"Coltura!C10","v":"A14"},{"$f":"Coltura!D10","v":"Clementine frutti, legno e foglie"},0.28000000000000003,0.13,0.43,"sì",{"$f":"(Standard!E12)","v":25},70.000000000000014,32.5,107.5,"frutti"]
[10,{"$f":"Coltura!C11","v":"A16"},{"$f":"Coltura!D11","v":"Fico frutti, legno e foglie"},1.1399999999999999,0.75,1,"sì",{"$f":"(Standard!E13)","v":"nd"},null,null,null,"frutti"]
[11,{"$f":"Coltura!C12","v":"A18"},{"$f":"Coltura!D12","v":"Kaki frutti, legno e foglie"},0.57999999999999996,0.2,0.6,"sì",{"$f":"(Standard!E14)","v":25},144.99999999999997,50,150,"frutti"]
[12,{"$f":"Coltura!C13","v":"A20"},{"$f":"Coltura!D13","v":"Limone frutti, legno e foglie"},0.25,0.1,0.35,"sì",{"$f":"(Standard!E15)","v":30},75,30,105,"frutti"]
[13,{"$f":"Coltura!C14","v":"A22"},{"$f":"Coltura!D14","v":"Mandarino frutti, legno e foglie"},0.28000000000000003,0.13,0.94,"sì",{"$f":"(Standard!E16)","v":25},70.000000000000014,32.5,235,"frutti"]
[14,{"$f":"Coltura!C15","v":"A24"},{"$f":"Coltura!D15","v":"Mandorlo frutti, legno e foglie"},2.97,1.06,0.79,"sì",{"$f":"(Standard!E17)","v":"nd"},null,null,null,"frutti"]
[15,{"$f":"Coltura!C16","v":"A26"},{"$f":"Coltura!D16","v":"Melo frutti, legno e foglie"},0.28999999999999998,0.08,0.31,"sì",{"$f":"(Standard!E18)","v":40},116,32,124,"frutti"]
[16,{"$f":"Coltura!C17","v":"A28"},{"$f":"Coltura!D17","v":"Nashi frutti, legno e foglie"},0.6,null,null,"no",{"$f":"(Standard!E19)","v":"nd"},null,null,null,"frutti"]
[17,{"$f":"Coltura!C18","v":"A30"},{"$f":"Coltura!D18","v":"Nespolo frutti, legno e foglie"},0.8,null,null,"no",{"$f":"(Standard!E20)","v":"nd"},null,null,null,"frutti"]
[18,{"$f":"Coltura!C19","v":"A32"},{"$f":"Coltura!D19","v":"Nettarine frutti, legno e foglie"},0.64,0.14000000000000001,0.53,"sì",{"$f":"(Standard!E21)","v":25},160,35.000000000000007,132.5,"frutti"]
[19,{"$f":"Coltura!C20","v":"A34"},{"$f":"Coltura!D20","v":"Nocciolo frutti, legno e foglie"},3.15,1.35,2.9,"sì",{"$f":"(Standard!E22)","v":"nd"},null,null,null,"frutti"]
[20,{"$f":"Coltura!C21","v":"A36"},{"$f":"Coltura!D21","v":"Noce da frutto frutti, legno e foglie"},3.2,1,1.3,"sì",{"$f":"(Standard!E23)","v":4},128,40,52,"frutti"]
[21,{"$f":"Coltura!C22","v":"A38"},{"$f":"Coltura!D22","v":"Olivo olive, legno e foglie"},2.48,0.48,2,"sì",{"$f":"(Standard!E24)","v":4},99.2,19.2,80,"frutti"]
[22,{"$f":"Coltura!C23","v":"A40"},{"$f":"Coltura!D23","v":"Pero media produzione frutti, legno e foglie"},0.33,0.08,0.33,"sì",{"$f":"(Standard!E25)","v":30},99,24,99,"frutti"]
[23,{"$f":"Coltura!C24","v":"A41"},{"$f":"Coltura!D24","v":"Pero alta produzione frutti, legno e foglie"},0.33,0.08,0.33,{"$f":"IF(AND(D26>0,E26>0,F26>0),\"sì\",\"no\")","v":"sì"},{"$f":"(Standard!E26)","v":40},132,32,132,"frutti"]
[24,{"$f":"Coltura!C25","v":"A42"},{"$f":"Coltura!D25","v":"Pesco frutti, legno e foglie"},0.57999999999999996,0.17,0.57999999999999996,"sì",{"$f":"(Standard!E27)","v":25},144.99999999999997,42.5,144.99999999999997,"frutti"]
[25,{"$f":"Coltura!C26","v":"A43"},{"$f":"Coltura!D26","v":"Pioppo"},0.55000000000000004,null,null,"no",{"$f":"(Standard!E28)","v":"nd"},null,null,null,"parte aerea legnosa"]
[26,{"$f":"Coltura!C27","v":"A44"},{"$f":"Coltura!D27","v":"Pioppo da energia"},0.6,null,null,"no",{"$f":"(Standard!E29)","v":"nd"},null,null,null,"parte aerea legnosa"]
[27,{"$f":"Coltura!C28","v":"A46"},{"$f":"Coltura!D28","v":"Susino frutti, legno e foglie"},0.49,0.1,0.49,"sì",{"$f":"(Standard!E30)","v":25},122.5,25,122.5,"frutti"]
[28,{"$f":"Coltura!C29","v":"A48"},{"$f":"Coltura!D29","v":"Uva da tavola grappoli, tralci e foglie"},0.51,0.06,0.48,"sì",{"$f":"(Standard!E31)","v":25},127.5,15,120,"grappoli uva"]
[29,{"$f":"Coltura!C30","v":"A50"},{"$f":"Coltura!D30","v":"Vite per uva da vino (collina e montagna) grappoli, tralci e foglie "},0.56999999999999995,0.26,0.67,"sì",{"$f":"(Standard!E32)","v":10},56.999999999999993,26,67,"grappoli uva"]
[30,{"$f":"Coltura!C31","v":"A52"},{"$f":"Coltura!D31","v":"Vite per uva da vino (pianura) grappoli, legno e foglie"},0.62,0.28000000000000003,0.74,"sì",{"$f":"(Standard!E33)","v":20},124,56.000000000000007,148,"grappoli uva"]
[31,{"$f":"Coltura!C32","v":"E1"},{"$f":"Coltura!D32","v":"Altri cereali a paglia (pianta intera)"},{"$f":"AVERAGE(D45,D50,D52,D54,D56,D70,D78,D90)*0.8","v":2.2250000000000001},{"$f":"AVERAGE(E45,E50,E52,E54,E56,E70,E78,E90)*0.8","v":0.8580000000000001},{"$f":"AVERAGE(F45,F50,F52,F54,F56,F70,F78,F90)*0.8","v":1.7670000000000003},"sì",{"$f":"(Standard!E34)","v":"nd"},null,null,null,"granella + paglia"]
[32,{"$f":"Coltura!C33","v":"E2"},{"$f":"Coltura!D33","v":"Avena"},2.2400000000000002,0.67,0.51,"sì",{"$f":"(Standard!E35)","v":3.2},{"$f":"(D35*$H35)*10","v":71.680000000000007},{"$f":"(E35*$H35)*10","v":21.44},16.32,"granella"]
[33,{"$f":"Coltura!C34","v":"E3"},{"$f":"Coltura!D34","v":"Avena pianta intera"},2.2400000000000002,0.93,2.19,"sì",{"$f":"(Standard!E36)","v":3.2},{"$f":"(D36*$H36)*10","v":71.680000000000007},{"$f":"(E36*$H36)*10","v":29.760000000000005},{"$f":"(F36*$H36)*10","v":70.08},"granella + paglia"]
[34,{"$f":"Coltura!C35","v":"E4"},{"$f":"Coltura!D35","v":"Barbababietola da zucchero (pianta intera)"},0.31,0.16,0.33,"sì",{"$f":"(Standard!E37)","v":50},{"$f":"(D37*$H37)*10","v":155},{"$f":"(E37*$H37)*10","v":80},{"$f":"(F37*$H37)*10","v":165},"radici + colletti + foglie"]
[35,{"$f":"Coltura!C36","v":"E5"},{"$f":"Coltura!D36","v":"Barbabietola da zucchero  (radici)"},0.31,0.14000000000000001,0.21,"sì",{"$f":"(Standard!E38)","v":50},155,70.000000000000014,105,"radici + colletti + foglie"]
[36,{"$f":"Coltura!C37","v":"E6"},{"$f":"Coltura!D37","v":"Canapa da fibra"},0.43,0.2,0.6,"sì",{"$f":"(Standard!E39)","v":"nd"},null,null,null,"pianta intera"]
[37,{"$f":"Coltura!C38","v":"E7"},{"$f":"Coltura!D38","v":"Cavolo abissino"},6.91,null,null,"no",{"$f":"(Standard!E40)","v":"nd"},null,null,null,"parte aerea"]
[38,{"$f":"Coltura!C39","v":"E8"},{"$f":"Coltura!D39","v":"Cece"},3.68,1.08,1.74,"sì",{"$f":"(Standard!E41)","v":2},73.600000000000009,21.6,34.799999999999997,"grani"]
[39,{"$f":"Coltura!C40","v":"E9"},{"$f":"Coltura!D40","v":"Colza"},6.21,1.28,0.99,"sì",{"$f":"(Standard!E42)","v":2.5},155.25,32,24.75,"semi"]
[40,{"$f":"Coltura!C41","v":"E10"},{"$f":"Coltura!D41","v":"Colza pianta intera"},6.21,2.66,7.86,"sì",{"$f":"(Standard!E43)","v":2.5},{"$f":"(D43*$H43)*10","v":155.25},{"$f":"(E43*$H43)*10","v":66.5},196.50000000000003,"semi + residui"]
[41,{"$f":"Coltura!C42","v":"E11"},{"$f":"Coltura!D42","v":"Farro"},2.7,0.87,0.52,"sì",{"$f":"(Standard!E44)","v":2},{"$f":"(D44*$H44)*10","v":54},{"$f":"(E44*$H44)*10","v":17.399999999999999},{"$f":"(F44*$H44)*10","v":10.4},"granella"]
[42,{"$f":"Coltura!C43","v":"E12"},{"$f":"Coltura!D43","v":"Farro (pianta intera)"},2.7,0.98,1.53,"sì",{"$f":"(Standard!E45)","v":2},{"$f":"(D45*$H45)*10","v":54},{"$f":"(E45*$H45)*10","v":19.600000000000001},{"$f":"(F45*$H45)*10","v":30.6},"granella + residui"]
[43,{"$f":"Coltura!C44","v":"E13"},{"$f":"Coltura!D44","v":"Favino da granella"},4.3,1,4.4000000000000004,"sì",{"$f":"(Standard!E46)","v":2},{"$f":"(D46*$H46)*10","v":86},{"$f":"(E46*$H46)*10","v":20},{"$f":"(F46*$H46)*10","v":88},"granella"]
[44,{"$f":"Coltura!C45","v":"E14"},{"$f":"Coltura!D45","v":"Girasole (acheni)"},4.3099999999999996,1.24,1.1499999999999999,"sì",{"$f":"(Standard!E47)","v":3},129.30000000000001,37.199999999999996,34.5,"acheni"]
[45,{"$f":"Coltura!C46","v":"E15"},{"$f":"Coltura!D46","v":"Girasole (pianta intera)"},4.3099999999999996,1.9,8.51,"sì",{"$f":"(Standard!E48)","v":3},129.30000000000001,56.999999999999993,255.3,"acheni + residui"]
[46,{"$f":"Coltura!C47","v":"E16"},{"$f":"Coltura!D47","v":"Grano duro (granella)"},3.11,0.85,0.59,"sì",{"$f":"(Standard!E49)","v":6},186.6,51,35.4,"granella"]
[47,{"$f":"Coltura!C48","v":"E17"},{"$f":"Coltura!D48","v":"Grano duro (pianta intera)"},3.11,1.06,1.99,"sì",{"$f":"(Standard!E50)","v":6},{"$f":"(D50*$H50)*10","v":186.6},{"$f":"(E50*$H50)*10","v":63.6},{"$f":"(F50*$H50)*10","v":119.39999999999999},"granella + residui"]
[48,{"$f":"Coltura!C49","v":"E18"},{"$f":"Coltura!D49","v":"Grano tenero FP/FPS (granella)"},2.96,0.78,0.5,"sì",{"$f":"(Standard!E51)","v":6},{"$f":"(D51*$H51)*10","v":177.59999999999997},{"$f":"(E51*$H51)*10","v":46.8},{"$f":"(F51*$H51)*10","v":30},"granella"]
[49,{"$f":"Coltura!C50","v":"E19"},{"$f":"Coltura!D50","v":"Grano tenero FP/FPS (pianta intera)"},2.96,0.98,1.87,"sì",{"$f":"(Standard!E52)","v":6},177.59999999999997,58.8,112.2,"granella + residui"]
[50,{"$f":"Coltura!C51","v":"E20"},{"$f":"Coltura!D51","v":"Grano tenero biscottiero  (granella)"},2.81,0.98,0.61,"sì",{"$f":"(Standard!E53)","v":6},168.6,58.8,36.6,"granella"]
[51,{"$f":"Coltura!C52","v":"E21"},{"$f":"Coltura!D52","v":"Grano tenero biscottiero pianta intera"},2.81,1.19,2.29,"sì",{"$f":"(Standard!E54)","v":6},{"$f":"(D54*$H54)*10","v":168.6},{"$f":"(E54*$H54)*10","v":71.399999999999991},{"$f":"(F54*$H54)*10","v":137.4},"granella + residui"]
[52,{"$f":"Coltura!C53","v":"E22"},{"$f":"Coltura!D53","v":"Grano tenero FF (granella)"},3.11,0.87,0.53,"sì",{"$f":"(Standard!E55)","v":6},{"$f":"(D55*$H55)*10","v":186.6},{"$f":"(E55*$H55)*10","v":52.199999999999996},{"$f":"(F55*$H55)*10","v":31.8},"granella"]
[53,{"$f":"Coltura!C54","v":"E23"},{"$f":"Coltura!D54","v":"Grano tenero FF (pianta intera)"},3.11,1.06,1.99,"sì",{"$f":"(Standard!E56)","v":6},186.6,63.6,119.39999999999999,"granella + residui"]
[54,{"$f":"Coltura!C55","v":"E24"},{"$f":"Coltura!D55","v":"Lenticchia"},4.21,0.95,1.22,"sì",{"$f":"(Standard!E57)","v":"nd"},null,null,null,"granella"]
[55,{"$f":"Coltura!C56","v":"E25"},{"$f":"Coltura!D56","v":"Lino  fibra"},2.59,1.8,3.2,"sì",{"$f":"(Standard!E58)","v":"nd"},null,null,null,"pianta intera"]
[56,{"$f":"Coltura!C57","v":"E26"},{"$f":"Coltura!D57","v":"Lino granella"},3.63,1.4,1.3,"sì",{"$f":"(Standard!E59)","v":"nd"},null,null,null,"granella"]
[57,{"$f":"Coltura!C58","v":"E27"},{"$f":"Coltura!D58","v":"Lupino"},4.3,1,4.4000000000000004,"sì",{"$f":"(Standard!E60)","v":"nd"},null,null,null,"granella"]
[58,{"$f":"Coltura!C59","v":"E28"},{"$f":"Coltura!D59","v":"Mais da granella 300-400 (granella)"},2.27,0.69,0.38,"sì",{"$f":"(Standard!E61)","v":7},158.9,48.3,26.6,"granella"]
[59,{"$f":"Coltura!C60","v":"E29"},{"$f":"Coltura!D60","v":"Mais da granella 300-400 (pianta intera)"},2.27,1,2.23,"sì",{"$f":"(Standard!E62)","v":7},158.9,70,156.1,"granella + residui"]
[60,{"$f":"Coltura!C61","v":"E30"},{"$f":"Coltura!D61","v":"Mais da granella 500-700 (granella)"},2.27,0.69,0.38,"sì",{"$f":"(Standard!E63)","v":12},272.40000000000003,82.8,45.600000000000009,"granella"]
[61,{"$f":"Coltura!C62","v":"E31"},{"$f":"Coltura!D62","v":"Mais da granella 500-700 (pianta intera)"},2.27,1,2.23,"sì",{"$f":"(Standard!E64)","v":12},272.40000000000003,120,267.59999999999997,"granella + residui"]
[62,{"$f":"Coltura!C63","v":"E32"},{"$f":"Coltura!D63","v":"Mais dolce  (spighe)"},1.42,0.42,0.23,"sì",{"$f":"(Standard!E65)","v":16},227.2,67.2,36.800000000000004,"spighe"]
[63,{"$f":"Coltura!C64","v":"E33"},{"$f":"Coltura!D64","v":"Mais dolce (pianta intera)"},1.42,0.54,0.98,"sì",{"$f":"(Standard!E66)","v":16},227.2,86.4,156.80000000000001,"spighe + residui"]
[64,{"$f":"Coltura!C65","v":"E34"},{"$f":"Coltura!D65","v":"Mais trinciato classe 500"},0.39,0.15,0.33,"sì",{"$f":"(Standard!E67)","v":45},175.5,67.5,148.5,"pianta intera"]
[65,{"$f":"Coltura!C66","v":"E35"},{"$f":"Coltura!D66","v":"Mais trinciato classe 700"},0.39,0.15,0.33,{"$f":"IF(AND(D68>0,E68>0,F68>0),\"sì\",\"no\")","v":"sì"},{"$f":"(Standard!E68)","v":65},253.5,97.5,214.5,"pianta intera"]
[66,{"$f":"Coltura!C67","v":"E36"},{"$f":"Coltura!D67","v":"Orzo (granella)"},2.2400000000000002,0.8,0.52,"sì",{"$f":"(Standard!E69)","v":6.5},145.60000000000002,52,33.799999999999997,"granella"]
[67,{"$f":"Coltura!C68","v":"E37"},{"$f":"Coltura!D68","v":"Orzo (pianta intera)"},2.2400000000000002,0.98,1.89,"sì",{"$f":"(Standard!E70)","v":6.5},{"$f":"(D70*$H70)*10","v":145.60000000000002},{"$f":"(E70*$H70)*10","v":63.7},{"$f":"(F70*$H70)*10","v":122.85},"granella + residui"]
[{"$f":"(A70+1)","v":68},{"$f":"Coltura!C69","v":"E38"},{"$f":"Coltura!D69","v":"Panico"},1.49,0.39,1.79,"sì",{"$f":"(Standard!E71)","v":"nd"},null,null,null,"granella"]
[69,{"$f":"Coltura!C70","v":"E39"},{"$f":"Coltura!D70","v":"Pisello proteico"},4.55,0.88,1.28,"sì",{"$f":"(Standard!E72)","v":5},{"$f":"(D72*$H72)*10","v":227.5},{"$f":"(E72*$H72)*10","v":44},{"$f":"(F72*$H72)*10","v":64},"granella"]
[70,{"$f":"Coltura!C71","v":"E40"},{"$f":"Coltura!D71","v":"Pisello proteico + residui"},4.55,1.1599999999999999,4.2300000000000004,{"$f":"IF(AND(D73>0,E73>0,F73>0),\"sì\",\"no\")","v":"sì"},{"$f":"(Standard!E73)","v":5},227.5,58,211.50000000000003,"granellam + residui"]
[71,{"$f":"Coltura!C72","v":"E41"},{"$f":"Coltura!D72","v":"Rafano (da sovescio)"},0.13,0.09,0.44,"sì",{"$f":"(Standard!E74)","v":"nd"},null,null,null,"pianta intera"]
[72,{"$f":"Coltura!C73","v":"E42"},{"$f":"Coltura!D73","v":"Riso (granella)"},2.0299999999999998,0.7,0.55000000000000004,"sì",{"$f":"(Standard!E75)","v":7},142.1,48.999999999999993,38.500000000000007,"granella"]
[73,{"$f":"Coltura!C74","v":"E43"},{"$f":"Coltura!D74","v":"Riso (granella+paglia)"},2.0299999999999998,0.92,2.0699999999999998,"sì",{"$f":"(Standard!E76)","v":7},142.1,64.400000000000006,144.89999999999998,"granella + paglia"]
[74,{"$f":"Coltura!C75","v":"E44"},{"$f":"Coltura!D75","v":"Segale (granella)"},2.78,0.7,0.5,"sì",{"$f":"(Standard!E77)","v":4},111.19999999999999,28,20,"granella"]
[75,{"$f":"Coltura!C76","v":"E45"},{"$f":"Coltura!D76","v":"Segale pianta intera"},2.78,1.23,3.11,"sì",{"$f":"(Standard!E78)","v":4},{"$f":"(D78*$H78)*10","v":111.19999999999999},{"$f":"(E78*$H78)*10","v":49.2},{"$f":"(F78*$H78)*10","v":124.39999999999999},"granella + paglia"]
[76,{"$f":"Coltura!C77","v":"E46"},{"$f":"Coltura!D77","v":"Senape indiana"},6.91,null,null,"no",{"$f":"(Standard!E79)","v":"nd"},null,null,null,"semi"]
[77,{"$f":"Coltura!C78","v":"E47"},{"$f":"Coltura!D78","v":"Soia (granella)"},6.3,1.36,2.0099999999999998,"sì",{"$f":"(Standard!E80)","v":3.5},{"$f":"(D80*$H80)*10","v":220.5},{"$f":"(E80*$H80)*10","v":47.600000000000009},{"$f":"(F80*$H80)*10","v":70.349999999999994},"granella"]
[78,{"$f":"Coltura!C79","v":"E48"},{"$f":"Coltura!D79","v":"Soia (pianta intera)"},6.3,1.76,3.05,"sì",{"$f":"(Standard!E81)","v":3.5},220.5,61.6,106.74999999999999,"granella + residui"]
[79,{"$f":"Coltura!C80","v":"E49"},{"$f":"Coltura!D80","v":"Sorgo da foraggio"},0.3,0.1,0.35,"sì",{"$f":"(Standard!E82)","v":"nd"},null,null,null,"pianta intera trinciata o verde"]
[80,{"$f":"Coltura!C81","v":"E50"},{"$f":"Coltura!D81","v":"Sorgo da granella  (solo granella)"},2.4700000000000002,0.73,0.43,"sì",{"$f":"(Standard!E83)","v":7.5},185.25000000000003,54.75,32.25,"granella"]
[81,{"$f":"Coltura!C82","v":"E51"},{"$f":"Coltura!D82","v":"Sorgo da granella (pianta intera)"},2.4700000000000002,0.95,1.57,"sì",{"$f":"(Standard!E84)","v":7.5},185.25000000000003,71.25,117.75,"granella + residui"]
[82,{"$f":"Coltura!C83","v":"E52"},{"$f":"Coltura!D83","v":"Tabacco Bright"},2.62,0.6,3.5,"sì",{"$f":"(Standard!E85)","v":"nd"}]
[83,{"$f":"Coltura!C84","v":"E53"},{"$f":"Coltura!D84","v":"Tabacco Bright pianta intera"},2.62,1.04,4.09,"sì",{"$f":"(Standard!E86)","v":"nd"}]
[84,{"$f":"Coltura!C85","v":"E54"},{"$f":"Coltura!D85","v":"Tabacco Burley"},3.71,0.3,3.7,"sì",{"$f":"(Standard!E87)","v":"nd"}]
[85,{"$f":"Coltura!C86","v":"E55"},{"$f":"Coltura!D86","v":"Tabacco Burley pianta intera"},3.71,0.62,5.1100000000000003,"sì",{"$f":"(Standard!E88)","v":"nd"}]
[86,{"$f":"Coltura!C87","v":"E56"},{"$f":"Coltura!D87","v":"Triticale"},2.54,0.7,0.5,"sì",{"$f":"(Standard!E89)","v":7.5},190.5,52.5,37.5,"granella"]
[87,{"$f":"Coltura!C88","v":"E57"},{"$f":"Coltura!D88","v":"Triticale pianta intera"},2.54,1.1000000000000001,3,"sì",{"$f":"(Standard!E90)","v":7.5},{"$f":"(D90*$H90)*10","v":190.5},{"$f":"(E90*$H90)*10","v":82.5},{"$f":"(F90*$H90)*10","v":225},"granella + paglia"]
[88,{"$f":"Coltura!C89","v":"F1"},{"$f":"Coltura!D89","v":"Avena insilata"},0.46,{"$f":"N91","v":0.20150000000000001},{"$f":"O91","v":0.47449999999999992},"sì",{"$f":"(3.2*3)/0.65","v":14.76923076923077},{"$f":"(D91*$H91)*10","v":67.938461538461553},29.760000000000005,70.079999999999984,"pianta trinciata",{"$f":"(I36/H91)/10","v":0.48533333333333334},{"$f":"(J36/$H91)/10","v":0.20150000000000001},{"$f":"(K36/$H91)/10","v":0.47449999999999992}]
[89,{"$f":"Coltura!C90","v":"F2"},{"$f":"Coltura!D90","v":"Colza insilato"},0.94,{"$f":"N92","v":0.40209302325581397},{"$f":"O92","v":1.1881395348837214},"sì",{"$f":"(2.5*4.3)/0.65","v":16.538461538461537},155.46153846153845,66.5,196.50000000000006,"pianta trinciata",{"$f":"(I43/H92)/10","v":0.9387209302325582},{"$f":"(J43/$H92)/10","v":0.40209302325581397},{"$f":"(K43/$H92)/10","v":1.1881395348837214}]
[90,{"$f":"Coltura!C91","v":"F3"},{"$f":"Coltura!D91","v":"Erba mazzolina"},1.89,0.47,2.81,"sì",{"$f":"(Standard!E93)","v":12.5},null,null,null,"fieno"]
[91,{"$f":"Coltura!C92","v":"F4"},{"$f":"Coltura!D92","v":"Erba medica"},2.06,0.53,2.0299999999999998,"sì",{"$f":"(Standard!E94)","v":12.5},null,null,null,"fieno"]
[92,{"$f":"Coltura!C93","v":"F5"},{"$f":"Coltura!D93","v":"Erbai aut prim. Di cer. O cruc."},1.36,{"$f":"(N95)","v":0.65},{"$f":"(O95)","v":1.22},"sì",11,{"$f":"(D95*$H95)*10","v":149.60000000000002},71.5,134.19999999999999,"fieno",null,0.65,1.22]
[93,{"$f":"Coltura!C94","v":"F6"},{"$f":"Coltura!D94","v":"Erbai aut prim. Di leguminose"},0.68,{"$f":"(N96)","v":0.27},{"$f":"(O96)","v":1.08},"sì",25,170,67.5,270,"foraggio verde",null,0.27,1.08]
[94,{"$f":"Coltura!C95","v":"F7"},{"$f":"Coltura!D95","v":"Erbai biennali o Prati avv. di Graminacee"},2.0699999999999998,0.55000000000000004,2.4500000000000002,"sì",{"$f":"(Standard!E97)","v":"nd"},null,null,null,"fieno"]
[95,{"$f":"Coltura!C96","v":"F8"},{"$f":"Coltura!D96","v":"Erbai biennali misti o Prati avv. Polifita"},1.79,0.75,2.7,"sì",{"$f":"(Standard!E98)","v":"nd"},null,null,null,"fieno"]
[96,{"$f":"Coltura!C97","v":"F9"},{"$f":"Coltura!D97","v":"Farro insilato"},0.5,{"$f":"N99","v":0.18200000000000002},{"$f":"O99","v":0.28414285714285714},"sì",{"$f":"(2*3.5)/0.65","v":10.769230769230768},{"$f":"(D99*$H99)*10","v":53.84615384615384},{"$f":"(E99*$H99)*10","v":19.600000000000001},{"$f":"(F99*$H99)*10","v":30.599999999999994},"pianta trinciata",{"$f":"(I44/H99)/10","v":0.50142857142857156},{"$f":"(J45/$H99)/10","v":0.18200000000000002},{"$f":"(K45/$H99)/10","v":0.28414285714285714}]
[97,{"$f":"Coltura!C98","v":"F10"},{"$f":"Coltura!D98","v":"Festuca arundinacea"},2.04,0.65,1.22,"sì",12.5,{"$f":"(D100*$H100)*10","v":255},{"$f":"(E100*$H100)*10","v":81.25},{"$f":"(F100*$H100)*10","v":152.5},"fieno"]
[98,{"$f":"Coltura!C99","v":"F11"},{"$f":"Coltura!D99","v":"Fleolo (coda di topo)"},2.0699999999999998,0.65,1.22,"sì",12.5,258.74999999999994,81.25,152.5,"fieno"]
[99,{"$f":"Coltura!C100","v":"F12"},{"$f":"Coltura!D100","v":"Grano duro  insilato"},0.62,{"$f":"N102","v":0.21200000000000002},{"$f":"O102","v":0.39799999999999996},"sì",{"$f":"(6*3.25)/0.65","v":30},{"$f":"(D102*$H102)*10","v":186},{"$f":"(E102*$H102)*10","v":63.6},{"$f":"(F102*$H102)*10","v":119.39999999999999},"pianta trinciata",{"$f":"(I50/H102)/10","v":0.622},{"$f":"(J50/$H102)/10","v":0.21200000000000002},{"$f":"(K50/$H102)/10","v":0.39799999999999996}]
[100,{"$f":"Coltura!C101","v":"F13"},{"$f":"Coltura!D101","v":"Grano tenero  insilato"},0.56000000000000005,{"$f":"N103","v":0.23799999999999999},{"$f":"O103","v":0.45800000000000002},"sì",{"$f":"(6*3.25)/0.65","v":30},{"$f":"(D103*$H103)*10","v":168},{"$f":"(E103*$H103)*10","v":71.399999999999991},{"$f":"(F103*$H103)*10","v":137.4},"pianta trinciata",{"$f":"(I54/H103)/10","v":0.56200000000000006},{"$f":"(J54/$H103)/10","v":0.23799999999999999},{"$f":"(K54/$H103)/10","v":0.45800000000000002}]
[101,{"$f":"Coltura!C102","v":"F14"},{"$f":"Coltura!D102","v":"Loglio da insilare"},0.9,0.4,0.8,"sì",22,{"$f":"(D104*$H104)*10","v":198},88,176,"pianta trinciata"]
[102,{"$f":"Coltura!C103","v":"F15"},{"$f":"Coltura!D103","v":"Loiessa"},1.53,0.69,2.25,"sì",12.5,{"$f":"(D105*$H105)*10","v":191.25},{"$f":"(E105*$H105)*10","v":86.25},{"$f":"(F105*$H105)*10","v":281.25},"fieno"]
[103,{"$f":"Coltura!C104","v":"F16"},{"$f":"Coltura!D104","v":"Loietto perenne"},2.0699999999999998,0.69,2.25,"sì",9,{"$f":"(D106*$H106)*10","v":186.29999999999998},{"$f":"(E106*$H106)*10","v":62.099999999999994},{"$f":"(F106*$H106)*10","v":202.5},"fieno"]
[104,{"$f":"Coltura!C105","v":"F17"},{"$f":"Coltura!D105","v":"Orzo insilato"},0.44,{"$f":"N107","v":0.19303030303030305},{"$f":"O107","v":0.37227272727272726},"sì",33,{"$f":"(D107*$H107)*10","v":145.19999999999999},63.70000000000001,122.85,"pianta trinciata",{"$f":"(I70/H107)/10","v":0.44121212121212128},{"$f":"(J70/$H107)/10","v":0.19303030303030305},{"$f":"(K70/$H107)/10","v":0.37227272727272726}]
[105,{"$f":"Coltura!C106","v":"F18"},{"$f":"Coltura!D106","v":"Prati di graminacee"},1.95,0.72,1.81,"sì",10,{"$f":"(D108*$H108)*10","v":195},72,181,"fieno"]
[106,{"$f":"Coltura!C107","v":"F19"},{"$f":"Coltura!D107","v":"Prati di trifoglio"},2.0699999999999998,0.6,2.4500000000000002,"sì",11,227.7,66,269.5,"fieno"]
[107,{"$f":"Coltura!C108","v":"F20"},{"$f":"Coltura!D108","v":"Prati pascoli in collina"},2.27,0.39,2.2999999999999998,"sì",{"$f":"(Standard!E110)","v":"nd"},null,null,null,"pascolo + fieno"]
[108,{"$f":"Coltura!C109","v":"F21"},{"$f":"Coltura!D109","v":"Prati polifiti >50% leguminose"},2.48,0.47,2.2999999999999998,"sì",{"$f":"(Standard!E111)","v":"nd"},null,null,null,"fieno"]
[109,{"$f":"Coltura!C110","v":"F22"},{"$f":"Coltura!D110","v":"Prati polifiti"},2.25,0.51,2.04,"sì",8.5,{"$f":"(D112*$H112)*10","v":191.25},{"$f":"(E112*$H112)*10","v":43.35},{"$f":"(F112*$H112)*10","v":173.4},"fieno"]
[110,{"$f":"Coltura!C111","v":"F23"},{"$f":"Coltura!D111","v":"Prati stabili in pianura"},1.83,0.72,1.81,"sì",8.5,{"$f":"(D113*$H113)*10","v":155.55000000000001},{"$f":"(E113*$H113)*10","v":61.2},{"$f":"(F113*$H113)*10","v":153.85},"fieno"]
[111,{"$f":"Coltura!C112","v":"F24"},{"$f":"Coltura!D112","v":"Prato misto"},1.8,null,null,"no",{"$f":"(Standard!E114)","v":"nd"},null,null,null,"fieno"]
[112,{"$f":"Coltura!C113","v":"F25"},{"$f":"Coltura!D113","v":"Segale insilato"},0.51,{"$f":"N115","v":0.22363636363636363},{"$f":"O115","v":0.56545454545454543},"sì",22,{"$f":"(D115*$H115)*10","v":112.2},{"$f":"(E115*$H115)*10","v":49.2},{"$f":"(F115*$H115)*10","v":124.39999999999999},"pianta trinciata",{"$f":"(I78/H115)/10","v":0.50545454545454538},{"$f":"(J78/$H115)/10","v":0.22363636363636363},{"$f":"(K78/$H115)/10","v":0.56545454545454543}]
[113,{"$f":"Coltura!C114","v":"F26"},{"$f":"Coltura!D114","v":"Triticale insilato"},0.51,{"$f":"N116","v":0.22297297297297297},{"$f":"O116","v":0.60810810810810811},"sì",37,{"$f":"(D116*$H116)*10","v":188.70000000000002},{"$f":"(E116*$H116)*10","v":82.5},{"$f":"(F116*$H116)*10","v":225},"pianta trinciata",{"$f":"(I90/H116)/10","v":0.51486486486486482},{"$f":"(J90/$H116)/10","v":0.22297297297297297},{"$f":"(K90/$H116)/10","v":0.60810810810810811}]
[114,{"$f":"Coltura!C115","v":"O1"},{"$f":"Coltura!D115","v":"Aglio"},1.08,0.27,0.95,"sì",{"$f":"(Standard!E117)","v":9},{"$f":"(D117*$H117)*10","v":97.2},{"$f":"(E117*$H117)*10","v":24.3},{"$f":"(F117*$H117)*10","v":85.499999999999986},"bulbi"]
[115,{"$f":"Coltura!C116","v":"O2"},{"$f":"Coltura!D116","v":"Asparago verde (pianta intera)"},2.56,0.66,2.2400000000000002,"sì",{"$f":"(Standard!E118)","v":8},204.8,52.800000000000004,179.20000000000002,"turrioni + parte aerea asportata a fine estate",null,null,null,"modificati il 20/04/2017"]
[116,{"$f":"Coltura!C117","v":"O3"},{"$f":"Coltura!D117","v":"Basilico media produzione"},0.37,0.13,0.39,"sì",{"$f":"(Standard!E119)","v":20},74,26,78,"foglie"]
[117,{"$f":"Coltura!C118","v":"O4"},{"$f":"Coltura!D118","v":"Basilico alta produzione più tagli"},0.37,0.13,0.39,"sì",{"$f":"(Standard!E120)","v":55},203.5,71.5,214.5,"foglie"]
[118,{"$f":"Coltura!C119","v":"O5"},{"$f":"Coltura!D119","v":"Bietola da costa e da foglia m. fresco  media produzione"},0.46,0.19,0.56999999999999995,"sì",{"$f":"(Standard!E121)","v":25},115,47.5,142.49999999999997,"foglie"]
[119,{"$f":"Coltura!C120","v":"O6"},{"$f":"Coltura!D120","v":"Bietola da costa e da foglia m. fresco  alta produzione più tagli"},0.46,0.19,0.56999999999999995,"sì",{"$f":"(Standard!E122)","v":35},161,66.5,199.5,"foglie"]
[120,{"$f":"Coltura!C121","v":"O7"},{"$f":"Coltura!D121","v":"Bietola da foglie per l'industria media produzione più tagli"},0.54,0.3,0.55000000000000004,"sì",{"$f":"(Standard!E123)","v":25},135,75,137.50000000000003,"foglie"]
[121,{"$f":"Coltura!C122","v":"O8"},{"$f":"Coltura!D122","v":"Bietola da costa per l'industria alta produzione più tagli"},0.54,0.3,0.55000000000000004,{"$f":"IF(AND(D124>0,E124>0,F124>0),\"sì\",\"no\")","v":"sì"},{"$f":"(Standard!E124)","v":35},189.00000000000003,105,192.5,"foglie"]
[122,{"$f":"Coltura!C123","v":"O9"},{"$f":"Coltura!D123","v":"Broccoletto  - Cime di rapa"},0.41,0.16,0.49,"sì",{"$f":"(Standard!E125)","v":"nd"},null,null,null,"infiorescenze + foglie"]
[123,{"$f":"Coltura!C124","v":"O10"},{"$f":"Coltura!D124","v":"Broccolo media produzione"},0.52,0.18,0.56999999999999995,"sì",{"$f":"(Standard!E126)","v":20},104,36,113.99999999999999,"infiorescenze"]
[124,{"$f":"Coltura!C125","v":"O11"},{"$f":"Coltura!D125","v":"Broccolo alta produzione"},0.52,0.18,0.56999999999999995,{"$f":"IF(AND(D127>0,E127>0,F127>0),\"sì\",\"no\")","v":"sì"},{"$f":"(Standard!E127)","v":32.5},169.00000000000003,58.5,185.25,"infiorescenze"]
[125,{"$f":"Coltura!C126","v":"O12"},{"$f":"Coltura!D126","v":"Cappuccio media produzione"},0.53,0.19,0.53,"sì",{"$f":"(Standard!E128)","v":27},143.1,51.3,143.1,"teste"]
[126,{"$f":"Coltura!C127","v":"O13"},{"$f":"Coltura!D127","v":"Cappuccio alta produzione"},0.53,0.19,0.53,{"$f":"IF(AND(D129>0,E129>0,F129>0),\"sì\",\"no\")","v":"sì"},{"$f":"(Standard!E129)","v":50},265,95,265,"teste"]
[127,{"$f":"Coltura!C128","v":"O14"},{"$f":"Coltura!D128","v":"Carciofo"},0.81,0.21,1.08,"sì",{"$f":"(Standard!E130)","v":15.5},125.55000000000001,32.549999999999997,167.40000000000003,"capolini (cuore)"]
[128,{"$f":"Coltura!C129","v":"O15"},{"$f":"Coltura!D129","v":"Cardo media produzione"},0.59,0.11,0.53,"sì",{"$f":"(Standard!E131)","v":25.5},150.44999999999999,28.05,135.15,"costole"]
[129,{"$f":"Coltura!C130","v":"O16"},{"$f":"Coltura!D130","v":"Cardo alta produzione"},0.59,0.11,0.53,{"$f":"IF(AND(D132>0,E132>0,F132>0),\"sì\",\"no\")","v":"sì"},{"$f":"(Standard!E132)","v":32.5},191.75,35.75,172.25,"costole"]
[130,{"$f":"Coltura!C131","v":"O17"},{"$f":"Coltura!D131","v":"Carota"},0.41,0.16,0.69,"sì",{"$f":"(Standard!E133)","v":50},205,80,345,"radici"]
[131,{"$f":"Coltura!C132","v":"O18"},{"$f":"Coltura!D132","v":"Cavolfiore media produzione"},0.47,0.15,0.56000000000000005,"sì",{"$f":"(Standard!E134)","v":35},164.5,52.5,196,"infiorescenze (palle)"]
[{"$f":"(A134+1)","v":132},{"$f":"Coltura!C133","v":"O19"},{"$f":"Coltura!D133","v":"Cavolfiore alta produzione"},0.47,0.15,0.56000000000000005,{"$f":"IF(AND(D135>0,E135>0,F135>0),\"sì\",\"no\")","v":"sì"},{"$f":"(Standard!E135)","v":45},211.5,67.5,252.00000000000003,"infiorescenze (palle)"]
[133,{"$f":"Coltura!C134","v":"O20"},{"$f":"Coltura!D134","v":"Cavolo verza mercato media produzione"},0.55000000000000004,0.2,0.56999999999999995,{"$f":"IF(AND(D136>0,E136>0,F136>0),\"sì\",\"no\")","v":"sì"},{"$f":"(Standard!E136)","v":24},132,48.000000000000007,136.80000000000001,"teste"]
[134,{"$f":"Coltura!C135","v":"O21"},{"$f":"Coltura!D135","v":"Cavolo verza mercato alta produzione"},0.55000000000000004,0.2,0.56999999999999995,"sì",{"$f":"(Standard!E137)","v":50},275.00000000000006,100,284.99999999999994,"teste"]
[135,{"$f":"Coltura!C136","v":"O22"},{"$f":"Coltura!D136","v":"Cavolo Riccio, Cavolo nero e Cavolo Rapa"},0.44,0.19,0.41,"sì",{"$f":"(Standard!E138)","v":20},88,38,82,"foglie"]
[136,{"$f":"Coltura!C137","v":"O23"},{"$f":"Coltura!D137","v":"Cetriolo da mensa media produzione"},0.18,0.08,0.25,"sì",{"$f":"(Standard!E139)","v":120},215.99999999999997,96,300,"frutti (peponidi)"]
[137,{"$f":"Coltura!C138","v":"O24"},{"$f":"Coltura!D138","v":"Cetriolo da mensa alta produzione"},0.18,0.08,0.25,{"$f":"IF(AND(D140>0,E140>0,F140>0),\"sì\",\"no\")","v":"sì"},{"$f":"(Standard!E140)","v":150},270,120,375,"frutti (peponidi)"]
[138,{"$f":"Coltura!C139","v":"O25"},{"$f":"Coltura!D139","v":"Cicoria da mercato media produzione"},0.44,0.32,0.88,"sì",{"$f":"(Standard!E141)","v":28},123.2,89.600000000000009,246.4,"foglie/cespi"]
[139,{"$f":"Coltura!C140","v":"O26"},{"$f":"Coltura!D140","v":"Cicoria da mercato alta produzione"},0.44,0.32,0.88,{"$f":"IF(AND(D142>0,E142>0,F142>0),\"sì\",\"no\")","v":"sì"},{"$f":"(Standard!E142)","v":37.5},165,120,330,"foglie/cespi"]
[140,{"$f":"Coltura!C141","v":"O27"},{"$f":"Coltura!D141","v":"Cicoria da industria alta produzione più tagli"},0.44,0.32,0.88,{"$f":"IF(AND(D143>0,E143>0,F143>0),\"sì\",\"no\")","v":"sì"},{"$f":"(Standard!E143)","v":28},123.2,89.600000000000009,246.4,"foglie"]
[141,{"$f":"Coltura!C142","v":"O28"},{"$f":"Coltura!D142","v":"Cipolla"},0.31,0.12,0.32,"sì",{"$f":"(Standard!E144)","v":45},139.5,53.999999999999993,144,"bulbi"]
[142,{"$f":"Coltura!C143","v":"O29"},{"$f":"Coltura!D143","v":"Cocomero"},0.19,0.12,0.28999999999999998,"sì",{"$f":"(Standard!E145)","v":60},114,72,174,"frutti (peponidi)"]
[143,{"$f":"Coltura!C144","v":"O30"},{"$f":"Coltura!D144","v":"Endivie (indivie riccia e scarola) media produzione"},0.47,0.32,0.85,"sì",{"$f":"(Standard!E146)","v":34},159.79999999999998,108.80000000000001,289,"cespi"]
[144,{"$f":"Coltura!C145","v":"O31"},{"$f":"Coltura!D145","v":"Endivie (indivie riccia e scarola) alta produzione"},0.47,0.32,0.85,{"$f":"IF(AND(D147>0,E147>0,F147>0),\"sì\",\"no\")","v":"sì"},{"$f":"(Standard!E147)","v":45},211.5,144,382.5,"cespi"]
[145,{"$f":"Coltura!C146","v":"O32"},{"$f":"Coltura!D146","v":"Fagiolino"},0.75,0.25,0.75,"sì",{"$f":"(Standard!E148)","v":9},67.5,22.5,67.5,"baccelli"]
[146,{"$f":"Coltura!C147","v":"O33"},{"$f":"Coltura!D147","v":"Fagiolo in baccelli da sgranare"},3.84,2.06,3.46,{"$f":"IF(AND(D149>0,E149>0,F149>0),\"sì\",\"no\")","v":"sì"},{"$f":"(Standard!E149)","v":5},192,103,173,"baccelli da sgranare",null,null,null,"modificati il 14/12/2012"]
[147,{"$f":"Coltura!C148","v":"O34"},{"$f":"Coltura!D148","v":"Fagiolo secco"},6.6,3.55,5.95,"sì",3,{"$f":"(D150*$H150)*10","v":197.99999999999997},{"$f":"(E150*$H150)*10","v":106.49999999999999},{"$f":"(F150*$H150)*10","v":178.5},"granella"]
[148,{"$f":"Coltura!C149","v":"O35"},{"$f":"Coltura!D149","v":"Fava da consumo fresco"},0.74,0.21,0.42,"sì",25,{"$f":"(D151*$H151)*10","v":185},{"$f":"(E151*$H151)*10","v":52.5},{"$f":"(F151*$H151)*10","v":105},"baccelli"]
[149,{"$f":"Coltura!C150","v":"O36"},{"$f":"Coltura!D150","v":"Finocchio"},0.57999999999999996,0.11,0.81,"sì",{"$f":"(Standard!E152)","v":30},174,33,243,"grumoli"]
[150,{"$f":"Coltura!C151","v":"O37"},{"$f":"Coltura!D151","v":"Fragola "},0.45,0.23,0.71,"sì",{"$f":"(Standard!E153)","v":30},135,69,212.99999999999997,"frutti"]
[151,{"$f":"Coltura!C152","v":"O38"},{"$f":"Coltura!D152","v":"Lattuga"},0.31,0.09,0.5,"sì",{"$f":"(Standard!E154)","v":32},99.2,28.799999999999997,160,"cespi"]
[152,{"$f":"Coltura!C153","v":"O39"},{"$f":"Coltura!D153","v":"Lattuga coltura protetta"},0.31,0.09,0.5,"sì",32,{"$f":"(D155*$H155)*10","v":99.2},{"$f":"(E155*$H155)*10","v":28.799999999999997},{"$f":"(F155*$H155)*10","v":160},"cespi"]
[153,{"$f":"Coltura!C154","v":"O40"},{"$f":"Coltura!D154","v":"Melanzana in pieno campo media produzione"},0.52,0.19,0.62,{"$f":"IF(AND(D156>0,E156>0,F156>0),\"sì\",\"no\")","v":"sì"},{"$f":"(Standard!E156)","v":80},416,152,496,"frutti (bacche)"]
[154,{"$f":"Coltura!C155","v":"O41"},{"$f":"Coltura!D155","v":"Melanzana coltura protetta alta produzione"},0.52,0.19,0.62,"sì",{"$f":"(Standard!E157)","v":150},780,285,930,"frutti (bacche)"]
[155,{"$f":"Coltura!C156","v":"O42"},{"$f":"Coltura!D156","v":"Melone"},0.39,0.17,0.56999999999999995,"sì",{"$f":"(Standard!E158)","v":40},156,68,227.99999999999997,"frutti (peponidi)"]
[156,{"$f":"Coltura!C157","v":"O43"},{"$f":"Coltura!D157","v":"Patata"},0.42,0.15,0.7,"sì",{"$f":"(Standard!E159)","v":47.5},199.5,71.25,332.5,"tuberi"]
[157,{"$f":"Coltura!C158","v":"O44"},{"$f":"Coltura!D158","v":"Peperone in serra alta produzione"},0.38,0.14000000000000001,0.5,"sì",{"$f":"(Standard!E160)","v":70},266,98,350,"bacche"]
[158,{"$f":"Coltura!C159","v":"O45"},{"$f":"Coltura!D159","v":"Peperone in serra media produzione"},0.38,0.14000000000000001,0.5,"sì",{"$f":"(Standard!E161)","v":50},190,70.000000000000014,250,"bacche"]
[159,{"$f":"Coltura!C160","v":"O46"},{"$f":"Coltura!D160","v":"Piccoli frutti"},1.5,null,null,"no",{"$f":"(Standard!E162)","v":"nd"}]
[160,{"$f":"Coltura!C161","v":"O47"},{"$f":"Coltura!D161","v":"Pisello da industria (grani)"},3.958333333333333,0.65833333333333344,1.875,"sì",5,197.91666666666663,32.916666666666671,93.75,"semi freschi (grani)",null,null,null,"modificati il 20/04/2017"]
[161,{"$f":"Coltura!C162","v":"O48"},{"$f":"Coltura!D162","v":"Pisello da mercato fresco (baccelli)"},4.75,0.79,2.25,"sì",{"$f":"(Standard!E164)","v":6},285,47.400000000000006,135,"baccelli",null,null,null,"modificati il 20/04/2017"]
[162,{"$f":"Coltura!C163","v":"O49"},{"$f":"Coltura!D163","v":"Pomodoro da industria media produzione"},0.26,0.11,0.37,"sì",{"$f":"(Standard!E165)","v":70},182,77,259,"bacche"]
[163,{"$f":"Coltura!C164","v":"O50"},{"$f":"Coltura!D164","v":"Pomodoro da industria alta produzione"},0.26,0.11,0.37,"sì",{"$f":"(Standard!E166)","v":90},{"$f":"(D166*$H166)*10","v":234.00000000000003},{"$f":"(E166*$H166)*10","v":99},{"$f":"(F166*$H166)*10","v":333},"bacche"]
[164,{"$f":"Coltura!C165","v":"O51"},{"$f":"Coltura!D165","v":"Pomodoro da mensa a pieno campo"},0.26,0.12,0.41,"sì",{"$f":"(Standard!E167)","v":70},182,84,287,"bacche"]
[165,{"$f":"Coltura!C166","v":"O52"},{"$f":"Coltura!D166","v":"Pomodoro da mensa in serra"},0.26,0.1,0.4,"sì",{"$f":"(Standard!E168)","v":115},299,115,460,"bacche"]
[166,{"$f":"Coltura!C167","v":"O53"},{"$f":"Coltura!D167","v":"Porro"},0.38,0.14000000000000001,0.36,"sì",{"$f":"(Standard!E169)","v":40},{"$f":"(D169*$H169)*10","v":152},{"$f":"(E169*$H169)*10","v":56.000000000000007},{"$f":"(F169*$H169)*10","v":144}]
[167,{"$f":"Coltura!C168","v":"O54"},{"$f":"Coltura!D168","v":"Prezzemolo media produzione"},0.24,0.14000000000000001,0.45,"sì",{"$f":"(Standard!E170)","v":20},48,28.000000000000004,90]
[168,{"$f":"Coltura!C169","v":"O55"},{"$f":"Coltura!D169","v":"Prezzemolo alta produzione più tagli"},0.24,0.14000000000000001,0.45,{"$f":"IF(AND(D171>0,E171>0,F171>0),\"sì\",\"no\")","v":"sì"},{"$f":"(Standard!E171)","v":43.5},104.39999999999999,60.900000000000006,195.75]
[169,{"$f":"Coltura!C170","v":"O56"},{"$f":"Coltura!D170","v":"Radicchio (cicoria a foglie colorate) media produzione"},0.46,0.3,0.45,"sì",{"$f":"(Standard!E172)","v":20},92.000000000000014,60,90]
[170,{"$f":"Coltura!C171","v":"O57"},{"$f":"Coltura!D171","v":"Radicchio (cicoria a foglie colorate) alta produzione"},0.46,0.3,0.45,{"$f":"IF(AND(D173>0,E173>0,F173>0),\"sì\",\"no\")","v":"sì"},{"$f":"(Standard!E173)","v":35},161,105,157.5]
[171,{"$f":"Coltura!C172","v":"O58"},{"$f":"Coltura!D172","v":"Rapa"},0.31,0.26,1.2,"sì",{"$f":"(Standard!E174)","v":35},{"$f":"(D174*$H174)*10","v":108.5},{"$f":"(E174*$H174)*10","v":91},{"$f":"(F174*$H174)*10","v":420},"radici"]
[172,{"$f":"Coltura!C173","v":"O59"},{"$f":"Coltura!D173","v":"Ravanello"},0.46,0.19,0.36,"sì",{"$f":"(Standard!E175)","v":30},138,57,107.99999999999999]
[173,{"$f":"Coltura!C174","v":"O60"},{"$f":"Coltura!D174","v":"Rucola media produzione"},0.49,0.14000000000000001,0.53,"sì",{"$f":"(Standard!E176)","v":18.5},90.649999999999991,25.900000000000002,98.05]
[174,{"$f":"Coltura!C175","v":"O61"},{"$f":"Coltura!D175","v":"Rucola alta produzione con più tagli"},0.49,0.14000000000000001,0.53,"sì",{"$f":"(Standard!E177)","v":37},181.29999999999998,51.800000000000004,196.1]
[175,{"$f":"Coltura!C176","v":"O62"},{"$f":"Coltura!D176","v":"Scalogno"},0.27,0.13,0.27,"sì",{"$f":"(Standard!E178)","v":8},21.6,10.4,21.6]
[176,{"$f":"Coltura!C177","v":"O63"},{"$f":"Coltura!D177","v":"Sedano media produzione"},0.54,0.2,0.75,"sì",{"$f":"(Standard!E179)","v":50},270,100,375]
[177,{"$f":"Coltura!C178","v":"O64"},{"$f":"Coltura!D178","v":"Sedano alta produzione"},0.54,0.2,0.75,{"$f":"IF(AND(D180>0,E180>0,F180>0),\"sì\",\"no\")","v":"sì"},{"$f":"(Standard!E180)","v":80},432,160,600]
[178,{"$f":"Coltura!C179","v":"O65"},{"$f":"Coltura!D179","v":"Spinacio alta produzione con più tagli"},0.61,0.18,0.7,"sì",{"$f":"(Standard!E181)","v":27.5},167.75,49.5,192.5,null,null,null,null,"modificati il 20/04/2017"]
[179,{"$f":"Coltura!C180","v":"O66"},{"$f":"Coltura!D180","v":"Spinacio media produzione"},0.61,0.18,0.7,"sì",{"$f":"(Standard!E182)","v":20},{"$f":"(D182*$H182)*10","v":122},{"$f":"(E182*$H182)*10","v":36},{"$f":"(F182*$H182)*10","v":140},null,null,null,null,"modificati il 20/04/2017"]
[180,{"$f":"Coltura!C181","v":"O67"},{"$f":"Coltura!D181","v":"Verza - cavolo da mercato media produzione"},0.55000000000000004,0.2,0.56999999999999995,"sì",{"$f":"(Standard!E183)","v":24},132,48.000000000000007,136.80000000000001]
[181,{"$f":"Coltura!C182","v":"O68"},{"$f":"Coltura!D182","v":"Verza - cavolo da mercato alta produzione"},0.55000000000000004,0.2,0.56999999999999995,{"$f":"IF(AND(D184>0,E184>0,F184>0),\"sì\",\"no\")","v":"sì"},{"$f":"(Standard!E184)","v":50},275.00000000000006,100,284.99999999999994]
[182,{"$f":"Coltura!C183","v":"O69"},{"$f":"Coltura!D183","v":"Verza da industria"},0.41,0.21,0.55000000000000004,"sì",{"$f":"(Standard!E185)","v":35},143.5,73.5,192.5]
[183,{"$f":"Coltura!C184","v":"O70"},{"$f":"Coltura!D184","v":"Zucca"},0.39,0.1,0.7,"sì",{"$f":"(Standard!E186)","v":35},136.5,35,245]
[184,{"$f":"Coltura!C185","v":"O71"},{"$f":"Coltura!D185","v":"Zucchino da industria media produzione"},0.49,0.16,0.85,"sì",{"$f":"(Standard!E187)","v":50},245,80,425]
[185,{"$f":"Coltura!C186","v":"O72"},{"$f":"Coltura!D186","v":"Zucchino da industria alta produzione"},0.49,0.16,0.85,{"$f":"IF(AND(D188>0,E188>0,F188>0),\"sì\",\"no\")","v":"sì"},{"$f":"(Standard!E188)","v":65},318.5,104,552.5]
[186,{"$f":"Coltura!C187","v":"O73"},{"$f":"Coltura!D187","v":"Zucchino da mercato fresco media produzione"},0.44,0.16,0.78,"sì",{"$f":"(Standard!E189)","v":40},176,64,312]
[187,{"$f":"Coltura!C188","v":"O74"},{"$f":"Coltura!D188","v":"Zucchino da mercato  fresco alta produzione"},0.44,0.16,0.78,{"$f":"IF(AND(D190>0,E190>0,F190>0),\"sì\",\"no\")","v":"sì"},{"$f":"(Standard!E190)","v":50},220,80,390]
[188,{"$f":"Coltura!C189","v":"S1"},{"$f":"Coltura!D189","v":"Barbabiertola da seme (fase porta seme)"},0,0,0,"no",{"$f":"(Standard!E191)","v":"nd"}]
[189,{"$f":"Coltura!C190","v":"S2"},{"$f":"Coltura!D190","v":"Carota da seme (fase portaseme)"},0,0,0,"no",{"$f":"(Standard!E192)","v":"nd"}]
[190,{"$f":"Coltura!C191","v":"S3"},{"$f":"Coltura!D191","v":"Carota da seme (fase vivaio)"},0.41,0.16,0.69,"sì",{"$f":"(Standard!E193)","v":50},205,80,345]
[191,{"$f":"Coltura!C192","v":"S4"},{"$f":"Coltura!D192","v":"Cavoli da seme"},0,0,0,"no",{"$f":"(Standard!E194)","v":"nd"}]
[192,{"$f":"Coltura!C193","v":"S5"},{"$f":"Coltura!D193","v":"Cetriolo da seme"},0,0,0,"no",{"$f":"(Standard!E195)","v":"nd"}]
[193,{"$f":"Coltura!C194","v":"S6"},{"$f":"Coltura!D194","v":"Cicoria da seme"},0,0,0,"no",{"$f":"(Standard!E196)","v":"nd"}]
[194,{"$f":"Coltura!C195","v":"S7"},{"$f":"Coltura!D195","v":"Cipolla da seme (fase portaseme)"},0,0,0,"no",{"$f":"(Standard!E197)","v":"nd"}]
[195,{"$f":"Coltura!C196","v":"S8"},{"$f":"Coltura!D196","v":"Cipolla da seme (fase vivaio)"},0.31,0.12,0.32,"sì",{"$f":"(Standard!E198)","v":45},139.5,53.999999999999993,144]
[{"$f":"(A198+1)","v":196},{"$f":"Coltura!C197","v":"S9"},{"$f":"Coltura!D197","v":"Coriandolo da seme"},0,0,0,"no",{"$f":"(Standard!E199)","v":"nd"}]
[197,{"$f":"Coltura!C198","v":"S10"},{"$f":"Coltura!D198","v":"Erba medica  da seme"},2.06,0.53,2.0299999999999998,"sì",{"$f":"(Standard!E200)","v":"nd"}]
[198,{"$f":"Coltura!C199","v":"S11"},{"$f":"Coltura!D199","v":"Finocchio da seme"},0,0,0,"no",{"$f":"(Standard!E201)","v":"nd"}]
[199,{"$f":"Coltura!C200","v":"S12"},{"$f":"Coltura!D200","v":"Frumento duro da seme (granella)"},3.11,0.85,0.59,"sì",{"$f":"(Standard!E202)","v":6},186.6,51,35.4]
[200,{"$f":"Coltura!C201","v":"S13"},{"$f":"Coltura!D201","v":"Frumento tenero da seme (granella)"},2.96,0.78,0.5,"sì",{"$f":"(Standard!E203)","v":6},177.59999999999997,46.8,30]
[201,{"$f":"Coltura!C202","v":"S14"},{"$f":"Coltura!D202","v":"Girasole da seme (granella)"},4.3099999999999996,1.24,1.1499999999999999,"sì",{"$f":"(Standard!E204)","v":3},129.30000000000001,37.199999999999996,34.5]
[202,{"$f":"Coltura!C203","v":"S15"},{"$f":"Coltura!D203","v":"Lattuga da seme"},0,0,0,"no",{"$f":"(Standard!E205)","v":"nd"}]
[203,{"$f":"Coltura!C204","v":"S16"},{"$f":"Coltura!D204","v":"Orzo da seme (granella)"},2.2400000000000002,0.8,0.52,"sì",{"$f":"(Standard!E206)","v":6.5},145.60000000000002,52,33.799999999999997]
[204,{"$f":"Coltura!C205","v":"S17"},{"$f":"Coltura!D205","v":"Pisello proteico da seme (granella)"},4.55,0.88,1.28,"sì",{"$f":"(Standard!E207)","v":"nd"}]
[205,{"$f":"Coltura!C206","v":"S18"},{"$f":"Coltura!D206","v":"Prezzemolo da seme"},0,0,0,"no",{"$f":"(Standard!E208)","v":"nd"}]
[206,{"$f":"Coltura!C207","v":"S19"},{"$f":"Coltura!D207","v":"Ravanello da seme"},0,0,0,"no",{"$f":"(Standard!E209)","v":"nd"}]
[207,{"$f":"Coltura!C208","v":"S20"},{"$f":"Coltura!D208","v":"Segale da seme (granella)"},2.78,0.7,0.5,"sì",{"$f":"(Standard!E210)","v":4},{"$f":"(D210*$H210)*10","v":111.19999999999999},{"$f":"(E210*$H210)*10","v":28},{"$f":"(F210*$H210)*10","v":20},"granella"]
[208,{"$f":"Coltura!C209","v":"S21"},{"$f":"Coltura!D209","v":"Soia da seme (granella)"},6.3,1.36,2.0099999999999998,"sì",{"$f":"(Standard!E211)","v":3.5},220.5,47.600000000000009,70.349999999999994]
[209,{"$f":"Coltura!C210","v":"S22"},{"$f":"Coltura!D210","v":"Triticale da seme (granella)"},2.54,0.7,0.5,"sì",{"$f":"(Standard!E213)","v":11.5},292.10000000000002,80.499999999999986,57.5,"granella"]
[210,{"$f":"Coltura!C211","v":"BL1"},{"$f":"Coltura!D211","v":"Bietola da foglia"},0,0,0,"no",{"$f":"(Standard!E213)","v":11.5},0,0,0]
[211,{"$f":"Coltura!C212","v":"BL2"},{"$f":"Coltura!D212","v":"Cicorino"},0,0,0,"no",{"$f":"(Standard!E214)","v":11.5},0,0,0]
[212,{"$f":"Coltura!C213","v":"BL3"},{"$f":"Coltura!D213","v":"Foglie e steli di Brassica"},0,0,0,"no",{"$f":"(Standard!E215)","v":12},0,0,0]
[213,{"$f":"Coltura!C214","v":"BL4"},{"$f":"Coltura!D214","v":"Lattuga da cespo"},0.27,0.08,0.47,"sì",{"$f":"(Standard!E216)","v":12},32.400000000000006,9.6,56.4]
[214,{"$f":"Coltura!C215","v":"BL5"},{"$f":"Coltura!D215","v":"Lattughino 1° taglio"},0.48499999999999999,0.14000000000000001,0.52700000000000002,"sì",{"$f":"(Standard!E217)","v":10},48.5,14.000000000000002,52.7]
[215,{"$f":"Coltura!C216","v":"BL6"},{"$f":"Coltura!D216","v":"Lattughino 2° taglio"},0.48499999999999999,0.14000000000000001,0.52700000000000002,{"$f":"IF(AND(D218>0,E218>0,F218>0),\"sì\",\"no\")","v":"sì"},{"$f":"(Standard!E218)","v":10},{"$f":"(D218*$H218)*10","v":48.5},{"$f":"(E218*$H218)*10","v":14.000000000000002},{"$f":"(F218*$H218)*10","v":52.7}]
[216,{"$f":"Coltura!C217","v":"BL7"},{"$f":"Coltura!D217","v":"Rucola 1° taglio"},0.43,0.13,0.45,"sì",{"$f":"(Standard!E218)","v":10},43,13,45]
[217,{"$f":"Coltura!C218","v":"BL8"},{"$f":"Coltura!D218","v":"Rucola 2° taglio"},0.54,0.15,0.6,{"$f":"IF(AND(D220>0,E220>0,F220>0),\"sì\",\"no\")","v":"sì"},{"$f":"(Standard!E219)","v":32},{"$f":"(D220*$H220)*10","v":172.8},{"$f":"(E220*$H220)*10","v":48},{"$f":"(F220*$H220)*10","v":192}]
[218,{"$f":"Coltura!C219","v":"BL9"},{"$f":"Coltura!D219","v":"Spinacino 1° taglio"},0.33800000000000002,0.13300000000000001,0.71099999999999997,"sì",{"$f":"(Standard!E219)","v":32},108.16000000000001,42.56,227.51999999999998]
[219,{"$f":"Coltura!C220","v":"BL10"},{"$f":"Coltura!D220","v":"Spinacino 2° taglio"},0.33800000000000002,0.13300000000000001,0.71099999999999997,{"$f":"IF(AND(D222>0,E222>0,F222>0),\"sì\",\"no\")","v":"sì"},{"$f":"(Standard!E220)","v":11.5},{"$f":"(D222*$H222)*10","v":38.870000000000005},{"$f":"(E222*$H222)*10","v":15.295000000000002},{"$f":"(F222*$H222)*10","v":81.764999999999986}]
[220,{"$f":"Coltura!C221","v":"BL11"},{"$f":"Coltura!D221","v":"Valerianella"},0.49399999999999999,0.14599999999999999,0.58399999999999996,"sì",{"$f":"(Standard!E220)","v":11.5},56.81,16.79,67.16]
[221,{"$f":"Coltura!C222","v":"BL12"},{"$f":"Coltura!D222","v":"baby leaf generica"},0.38500000000000001,0.11600000000000001,0.56999999999999995,"sì",{"$f":"(Standard!E221)","v":11.5},44.275000000000006,13.34,65.55]
[]
["Criterio",null,null,null,null,null,"Bilancio"]
["ordinato","ID_Coltura","coltura","N","P2O5","K2O","(sì/no)","rif","N (kg)","P2O5 (kg)","K2O (kg)","parte","N","P2O5","K2O"]
[{"$f":"Coltura!A225","v":207},{"$f":"Coltura!C225","v":"S20"},{"$f":"DGET($A$3:$F$224,3,$A$227:$B$228)","v":"Segale da seme (granella)"},{"$f":"DGET($A$3:$F$224,4,$A$227:$B$228)","v":2.78},{"$f":"DGET($A$3:$F$224,5,$A$227:$B$228)","v":0.7},{"$f":"DGET($A$3:$F$224,6,$A$227:$B$228)","v":0.5},{"$f":"DGET($A$3:$G$224,7,$A$227:$B$228)","v":"sì"},{"$f":"DGET($A$3:$K$224,8,$A$227:$B$228)","v":4},{"$f":"DGET($A$3:$K$224,9,$A$227:$B$228)","v":111.19999999999999},{"$f":"DGET($A$3:$K$224,10,$A$227:$B$228)","v":28},{"$f":"DGET($A$3:$K$224,11,$A$227:$B$228)","v":20},{"$f":"DGET($A$3:$O$224,12,$A$227:$B$228)","v":"granella"},{"$f":"DGET($A$3:$O$224,13,$A$227:$B$228)","v":{"$error":"#VALUE!"}},{"$f":"DGET($A$3:$O$224,14,$A$227:$B$228)","v":{"$error":"#VALUE!"}},{"$f":"DGET($A$3:$O$224,15,$A$227:$B$228)","v":{"$error":"#VALUE!"}}]
[]
[null,null,null,null,"A"]
[null,null,null,{"$f":"(D228*Codici!$M2)*10","v":111.19999999999999},{"$f":"(E228*Codici!$M2)*10","v":28},{"$f":"(F228*Codici!$M2)*10","v":20}]
[]
[null,null,null,null,"Anticipazione annuale"]
[null,null,null,null,{"$f":"(E228*Codici!L2)*10","v":245},{"$f":"(F228*Codici!L2)*10","v":175}]

{"sheet":"Standard","index":5,"n_rows":237,"n_cols":82,"rows_kept":237,"cut":false,"hidden":true,"merged":[]}
[null,null,null,null,"t","N","P","P","P","P","K","K","K","K","t","N","N","N","N",null,"N","N","N","P","P","P","P","P","K","K","K","K","K","t","N","N","N","N","N","N","N","N","N","N","N","N","N","P","P","P","P","P","P","P","K","K","K","K","K",null,null,null,null,null,null,null,null,null,null,null,"N per  più tagli",null,null,null,"K per più tagli"]
[null,null,null,null,"S","t","a","n","d","a","r","d",null,null,"R","i","d","u","z","i","o","n","i",null,null,null,null,null,null,null,null,null,null,"I","n","c","r","e","m","e","n","t","i"]
["ordinato","ID_Coltura","coltura","fase","Resa_Standard","N_Standard","P2O5_X_dot_Normale","P2O5_X_dot_Bassa","P2O5_X_dot_Elevata","P2O5_X_dot_Molto_Bassa","K2O_X_dot_Normale-complessiva","K2O_X_dot_Bassa-complessiva","K2O_X_dot_Elevata-complessiva","K2O_X_dot_Molto_Bassa-complessiva","Resa bassa inferiore a","Rid_N_Resa","Ammendante nell'anno precedente","Eccessivo rigoglio vegetativo o varietà vigorose","Tenore SO nel suolo elevato","Tenore SO nel suolo molto elevato (>4%)","Dopo medica o prato > 5 anni","Dopo una  leguminosa"," 3° ciclo in poi","Rid_P2O5_Resa","Ammendante nell'anno precedente","Tenore SO nel suolo elevato"," 3° ciclo in poi","Localizzato","Rid_K2O_Resa","Ammendante nell'anno precedente","Tenore SO nel suolo elevato"," 3° ciclo in poi","Si prevede l'interramento della paglia","Resa alta superiore a","Inc_N_Resa","Tenore SO nel suolo basso","Scarso vigore vegetativo o varietà poco vigorose","Inc_N_Inerbito","Lisciviazione x surplus pluviometrico","Ristoppio o interramento paglie","Clima avverso, assenza inoculo","Terreno compattato o semina su sodo","Maggiori esigenze x ciclo o epoca","Alta densità/portinnesto debole","Prevalenza di graminacee","Produz. Sia autunnale che primaverile","N_Inc_Max","Inc_P2O5_Resa","Tenore SO nel suolo basso","Semina precoce","ristoppio o da 2 anni senza","Calcare attivo molto elevato","Produz. Sia autunnale che primaverile","Inc_P2O5 Max","Inc_K2O_Resa","non concimato l'anno preced. o Cv tardive","Inc_K2O_SO_bassa","Produz. Sia autunnale che primaverile","CV x consercvaz. e/o a destinaz. industriale","Inc_K2O max","N_I anno allevamento ","N_II anno allevamento","Inc_N_inizio produz","P2O5_I anno allevamento","P2O5_II anno allevamento","Inc_P2O5_inizio produz","K2O_I anno allevamento","K2O_II anno allevamento","Inc_K2O_inizio produz","più tagli","N_Standard  base","nota 1","incremento per taglio","nota 2","K2O_X_dot_Normale-base","K2O_X_dot_Bassa-base","K2O_X_dot_Elevata-base","K2O_X_dot_Molto_Bassa- base","incremento per taglio dot_Normale","incremento per taglio dot_Bassa","incremento per taglio dot_Elevata","incremento per taglio dot_Molto_Bassa"]
[1,{"$f":"Coltura!C2","v":"A2"},{"$f":"Coltura!D2","v":"Actinidia polpa verde frutti, legno e foglie"},"nd",25,120,50,100,20,100,130,200,75,200,20,30,20,20,20,0,0,0,0,10,0,0,0,0,30,0,0,0,0,30,30,20,20,0,15,0,0,0,0,0,0,0,40,10,20,0,0,30,0,60,30,0,0,0,0,30,55,85,0,15,25,0,20,40,0,"no"]
[2,{"$f":"Coltura!C3","v":"Ab2"},{"$f":"Coltura!D3","v":"Actinidia polpa gialla frutti, legno e foglie"},"nd",30,150,60,110,30,110,145,215,90,215,25,30,20,20,20,0,0,0,0,10,0,0,0,0,30,0,0,0,0,35,30,20,20,0,15,0,0,0,0,0,0,0,40,10,20,0,0,30,0,60,30,0,0,0,0,30,55,85,0,15,25,0,20,40,0,"no"]
[{"$f":"(A5+1)","v":3},{"$f":"Coltura!C4","v":"A4"},{"$f":"Coltura!D4","v":"Albicocco media produzione frutti, legno e foglie"},"nd",13,75,30,40,15,80,90,120,35,120,10,25,20,20,20,0,0,0,0,10,0,0,0,0,30,30,0,0,0,16,25,20,20,0,15,0,0,0,0,0,0,0,50,10,10,0,0,20,0,40,30,0,0,0,0,30,40,60,0,15,25,0,20,40,0,"no"]
[{"$f":"(A6+1)","v":4},{"$f":"Coltura!C5","v":"A5"},{"$f":"Coltura!D5","v":"Albicocco  alta produzione frutti, legno e foglie"},"nd",18,100,40,50,25,80,100,130,50,130,16,25,20,20,20,0,0,0,0,10,0,0,0,0,30,30,0,0,0,20,25,20,20,0,15,0,0,0,0,0,0,0,50,10,10,0,0,20,0,40,30,0,0,0,0,30,40,60,0,15,25,0,20,40,0,"no"]
[5,{"$f":"Coltura!C6","v":"A6"},{"$f":"Coltura!D6","v":"Altri fruttiferi frutti, legno e foglie"},"nd","nd","nd",null,null,null,null,null,null,null,null,null,null,null,null,null,null,null,null,null,null,null,null,null,null,null,null,null,null,null,"nd",null,null,null,null,null,null,null,null,null,null,null,null,null,null,null,null,null,null,null,0,null,null,null,null,null,0,null,null,null,null,null,null,null,null,null,"no"]
[6,{"$f":"Coltura!C7","v":"A8"},{"$f":"Coltura!D7","v":"Arancio frutti, legno e foglie"},"nd",30,120,60,100,20,100,100,120,50,120,24,15,20,20,0,0,0,0,0,10,10,0,0,0,25,30,0,0,0,36,15,20,20,0,15,0,0,0,0,0,0,0,50,10,10,0,0,20,0,40,25,0,0,0,0,25,null,null,null,null,null,null,null,null,null,"no"]
[7,{"$f":"Coltura!C8","v":"A10"},{"$f":"Coltura!D8","v":"Castagno solo frutti"},"nd","nd","nd",null,null,null,null,null,null,null,null,null,null,null,null,null,null,null,null,null,null,null,null,null,null,null,null,null,null,null,"nd",null,null,null,null,null,null,null,null,null,null,null,null,null,null,null,null,null,null,null,0,null,null,null,null,null,0,null,null,null,null,null,null,null,null,null,"no"]
[8,{"$f":"Coltura!C9","v":"A12"},{"$f":"Coltura!D9","v":"Ciliegio frutti, legno e foglie"},"nd",9,70,30,40,15,60,50,80,20,80,7,15,20,20,20,0,0,0,0,10,10,0,0,0,20,30,0,0,0,11,15,20,20,0,15,0,0,0,0,0,0,0,50,10,10,0,0,20,0,40,20,0,0,0,0,20,30,50,0,15,25,0,20,40,0,"no"]
[9,{"$f":"Coltura!C10","v":"A14"},{"$f":"Coltura!D10","v":"Clementine frutti, legno e foglie"},"nd",25,140,60,100,20,100,100,120,50,120,20,20,20,20,0,0,0,0,0,10,10,0,0,0,50,30,0,0,0,30,20,20,20,0,15,0,0,0,0,0,0,0,50,10,10,0,0,10,0,30,50,0,0,0,0,50,null,null,null,null,null,null,null,null,null,"no"]
[10,{"$f":"Coltura!C11","v":"A16"},{"$f":"Coltura!D11","v":"Fico frutti, legno e foglie"},"nd","nd","nd",null,null,null,null,null,null,null,null,null,null,null,null,null,null,null,null,null,null,null,null,null,null,null,null,null,null,null,"nd",null,null,null,null,null,null,null,null,null,null,null,null,null,null,null,null,null,null,null,0,null,null,null,null,null,0,null,null,null,null,null,null,null,null,null,"no"]
[11,{"$f":"Coltura!C12","v":"A18"},{"$f":"Coltura!D12","v":"Kaki frutti, legno e foglie"},"nd",25,60,30,60,10,60,75,100,30,100,20,30,20,20,0,0,0,0,0,10,10,0,0,0,30,30,0,0,0,30,30,20,20,0,15,0,0,0,0,0,0,0,40,10,10,0,0,0,0,20,30,0,0,0,0,30,25,40,0,15,20,0,20,40,0,"no"]
[12,{"$f":"Coltura!C13","v":"A20"},{"$f":"Coltura!D13","v":"Limone frutti, legno e foglie"},"nd",30,120,60,100,20,100,100,120,50,120,24,15,20,20,0,0,0,0,0,10,10,0,0,0,25,30,0,0,0,36,15,20,20,0,15,0,0,0,0,0,0,0,50,10,10,0,0,20,0,40,25,0,0,0,0,25,null,null,null,null,null,null,null,null,null,"no"]
[13,{"$f":"Coltura!C14","v":"A22"},{"$f":"Coltura!D14","v":"Mandarino frutti, legno e foglie"},"nd",25,140,60,100,20,100,100,120,50,120,20,20,20,20,0,0,0,0,0,10,10,0,0,0,50,30,0,0,0,30,20,20,20,0,15,0,0,0,0,0,0,0,50,10,10,0,0,10,0,30,50,0,0,0,0,50,null,null,null,null,null,null,null,null,null,"no"]
[14,{"$f":"Coltura!C15","v":"A24"},{"$f":"Coltura!D15","v":"Mandorlo frutti, legno e foglie"},"nd","nd","nd",null,null,null,null,null,null,null,null,null,null,null,null,null,null,null,null,null,null,null,null,null,null,null,null,null,null,null,"nd",null,null,null,null,null,null,null,null,null,null,null,null,null,null,null,null,null,null,null,0,null,null,null,null,null,0,null,null,null,null,null,null,null,null,null,"no"]
[15,{"$f":"Coltura!C16","v":"A26"},{"$f":"Coltura!D16","v":"Melo frutti, legno e foglie"},"nd",40,80,40,55,35,55,90,150,50,150,32,30,20,20,20,0,0,0,0,10,0,0,0,0,35,30,0,0,0,48,30,20,20,0,15,0,0,0,0,0,0,0,60,10,10,0,0,20,0,40,35,0,0,0,0,35,40,60,20,15,25,15,20,40,50,"no"]
[16,{"$f":"Coltura!C17","v":"A28"},{"$f":"Coltura!D17","v":"Nashi frutti, legno e foglie"},"nd","nd","nd",null,null,null,null,null,null,null,null,null,null,null,null,null,null,null,null,null,null,null,null,null,null,null,null,null,null,null,"nd",null,null,null,null,null,null,null,null,null,null,null,null,null,null,null,null,null,null,null,0,null,null,null,null,null,0,null,null,null,null,null,null,null,null,null,"no"]
[17,{"$f":"Coltura!C18","v":"A30"},{"$f":"Coltura!D18","v":"Nespolo frutti, legno e foglie"},"nd","nd","nd",null,null,null,null,null,null,null,null,null,null,null,null,null,null,null,null,null,null,null,null,null,null,null,null,null,null,null,"nd",null,null,null,null,null,null,null,null,null,null,null,null,null,null,null,null,null,null,null,0,null,null,null,null,null,0,null,null,null,null,null,null,null,null,null,"no"]
[18,{"$f":"Coltura!C19","v":"A32"},{"$f":"Coltura!D19","v":"Nettarine frutti, legno e foglie"},"nd",25,100,40,60,20,100,100,150,50,150,20,35,20,20,0,0,0,0,0,15,10,0,0,0,40,30,0,0,0,30,35,20,20,0,15,0,0,0,20,0,0,0,50,15,10,0,0,20,0,45,40,20,0,0,0,60,40,60,0,15,25,0,20,40,0,"no"]
[19,{"$f":"Coltura!C20","v":"A34"},{"$f":"Coltura!D20","v":"Nocciolo frutti, legno e foglie"},"nd","nd","nd",null,null,null,null,null,null,null,null,null,null,null,null,null,null,null,null,null,null,null,null,null,null,null,null,null,null,null,"nd",null,null,null,null,null,null,null,null,null,null,null,null,null,null,null,null,null,null,null,0,null,null,null,null,null,0,null,null,null,null,null,null,null,null,null,"no"]
[20,{"$f":"Coltura!C21","v":"A36"},{"$f":"Coltura!D21","v":"Noce da frutto frutti, legno e foglie"},"nd",4,90,40,60,20,80,60,100,20,100,3.2,15,20,20,20,0,0,0,0,10,0,0,0,0,20,0,0,0,0,4.8,15,20,20,0,15,0,0,0,0,0,0,0,50,10,10,0,0,20,0,40,20,0,0,0,0,20,30,50,0,20,30,0,20,40,0,"no"]
[21,{"$f":"Coltura!C22","v":"A38"},{"$f":"Coltura!D22","v":"Olivo olive, legno e foglie"},"nd",4,70,40,100,20,130,60,120,40,120,3,20,0,20,20,0,0,0,0,10,0,0,0,0,20,30,0,0,0,5,20,20,20,0,15,0,0,0,0,0,0,0,30,10,10,0,0,20,0,40,20,0,0,0,0,20,30,50,0,15,25,0,20,40,0,"no"]
[22,{"$f":"Coltura!C23","v":"A40"},{"$f":"Coltura!D23","v":"Pero media produzione frutti, legno e foglie"},"nd",30,90,30,60,10,60,100,150,50,150,24,25,20,20,20,0,0,0,0,10,0,0,0,0,25,30,0,0,0,36,25,20,20,0,15,0,0,0,0,30,0,0,50,10,10,0,0,20,0,40,25,0,0,0,0,25,40,60,20,15,25,0,20,40,20,"no"]
[23,{"$f":"Coltura!C24","v":"A41"},{"$f":"Coltura!D24","v":"Pero alta produzione frutti, legno e foglie"},"nd",40,120,30,60,10,60,120,170,70,170,35,25,20,20,20,0,0,0,0,10,0,0,0,0,25,30,0,0,0,45,25,20,20,0,15,0,0,0,0,30,0,0,50,10,10,0,0,20,0,40,25,0,0,0,0,25,40,60,20,15,25,0,20,40,20,"no"]
[24,{"$f":"Coltura!C25","v":"A42"},{"$f":"Coltura!D25","v":"Pesco frutti, legno e foglie"},"nd",25,100,40,60,20,100,100,150,50,150,20,35,20,20,20,0,0,0,0,15,0,0,0,0,40,30,0,0,0,30,35,20,20,0,15,0,0,0,20,0,0,0,50,15,10,0,0,20,0,45,40,20,0,0,0,60,40,60,0,15,25,0,20,40,0,"no"]
[25,{"$f":"Coltura!C26","v":"A43"},{"$f":"Coltura!D26","v":"Pioppo"},"nd","nd","nd",null,null,null,null,null,null,null,null,null,null,null,null,null,null,null,null,null,null,null,null,null,null,null,null,null,null,null,"nd",null,null,null,null,null,null,null,null,null,null,null,null,null,null,null,null,null,null,null,0,null,null,null,null,null,0,null,null,null,null,null,null,null,null,null,"no"]
[26,{"$f":"Coltura!C27","v":"A44"},{"$f":"Coltura!D27","v":"Pioppo da energia"},"nd","nd","nd",null,null,null,null,null,null,null,null,null,null,null,null,null,null,null,null,null,null,null,null,null,null,null,null,null,null,null,"nd",null,null,null,null,null,null,null,null,null,null,null,null,null,null,null,null,null,null,null,0,null,null,null,null,null,0,null,null,null,null,null,null,null,null,null,"no"]
[27,{"$f":"Coltura!C28","v":"A46"},{"$f":"Coltura!D28","v":"Susino frutti, legno e foglie"},"nd",25,90,40,60,20,60,100,150,50,150,20,25,20,20,20,0,0,0,0,10,0,0,0,0,20,30,0,0,0,30,25,20,20,0,15,0,0,0,20,0,0,0,50,10,10,0,0,20,0,40,20,0,0,0,0,20,40,60,0,15,25,0,20,40,0,"no"]
[28,{"$f":"Coltura!C29","v":"A48"},{"$f":"Coltura!D29","v":"Uva da tavola grappoli, tralci e foglie"},"nd",25,90,80,120,40,160,130,160,60,160,20,40,20,20,0,0,0,0,0,10,10,0,0,0,35,30,0,0,0,30,40,20,20,0,15,0,0,0,0,0,0,0,50,10,10,0,0,20,0,40,35,0,0,0,0,35,null,null,null,null,null,null,null,null,null,"no"]
[29,{"$f":"Coltura!C30","v":"A50"},{"$f":"Coltura!D30","v":"Vite per uva da vino (collina e montagna) grappoli, tralci e foglie "},"nd",10,50,40,60,20,100,80,150,40,150,8,20,20,20,20,0,0,0,0,10,10,0,0,0,30,30,0,0,0,12,20,20,20,0,15,0,0,0,0,0,0,0,40,10,10,0,0,20,0,40,30,0,0,0,0,30,30,50,0,15,25,0,20,40,0,"no"]
[30,{"$f":"Coltura!C31","v":"A52"},{"$f":"Coltura!D31","v":"Vite per uva da vino (pianura) grappoli, legno e foglie"},"nd",20,80,80,100,40,160,120,180,70,180,16,25,20,20,20,0,0,0,0,10,10,0,0,0,50,30,0,0,0,24,25,20,20,20,15,0,0,0,20,0,0,0,30,10,10,0,0,20,0,40,50,0,0,0,0,50,40,60,0,15,25,0,20,40,0,"no"]
[31,{"$f":"Coltura!C32","v":"E1"},{"$f":"Coltura!D32","v":"Altri cereali a paglia (pianta intera)"},"nd","nd","nd",null,null,null,null,null,null,null,null,null,null,null,null,null,null,null,null,null,null,null,null,null,null,null,null,null,null,null,"nd",null,null,null,null,null,null,null,null,null,null,null,null,null,null,null,null,null,null,null,0,null,null,null,null,null,0,0,0,null,0,0,null,0,0,null,"no"]
[32,{"$f":"Coltura!C33","v":"E2"},{"$f":"Coltura!D33","v":"Avena"},"nd",3.2,60,40,70,0,70,50,70,0,70,2.5,20,20,0,15,0,80,40,0,12,0,0,0,0,20,0,0,0,0,4,20,15,0,0,15,30,0,10,0,0,0,0,40,12,0,0,0,0,0,12,20,0,0,0,0,20,0,0,null,0,0,null,0,0,null,"no"]
[33,{"$f":"Coltura!C34","v":"E3"},{"$f":"Coltura!D34","v":"Avena pianta intera"},"nd",3.2,60,40,70,0,70,100,130,0,130,2.5,20,20,0,15,0,80,40,0,12,0,0,0,0,20,0,0,0,50,4,20,15,0,0,15,30,0,10,0,0,0,0,40,12,0,0,0,0,0,12,20,0,0,0,0,20,0,0,null,0,0,null,0,0,null,"no"]
[34,{"$f":"Coltura!C35","v":"E4"},{"$f":"Coltura!D35","v":"Barbababietola da zucchero (pianta intera)"},"nd",50,120,50,70,30,100,120,200,0,300,40,30,20,0,20,0,80,40,0,20,20,0,0,0,25,20,0,0,0,60,30,20,0,0,15,30,0,0,0,0,0,0,40,20,20,0,0,20,0,60,25,0,0,0,0,25,0,0,null,0,0,null,0,0,null,"no"]
[35,{"$f":"Coltura!C36","v":"E5"},{"$f":"Coltura!D36","v":"Barbabietola da zucchero  (radici)"},"nd",50,120,50,70,30,100,120,200,0,300,40,30,20,0,20,0,80,40,0,20,20,0,0,0,25,20,0,0,0,60,30,20,0,0,15,30,0,0,0,0,0,0,40,20,20,0,0,20,0,60,25,0,0,0,0,25,0,0,null,0,0,null,0,0,null,"no"]
[36,{"$f":"Coltura!C37","v":"E6"},{"$f":"Coltura!D37","v":"Canapa da fibra"},"nd","nd","nd",null,null,null,null,null,null,null,null,null,null,null,null,null,null,null,null,null,null,null,null,null,null,null,null,null,null,null,"nd",null,null,null,null,null,null,null,null,null,null,null,null,null,null,null,null,null,null,null,0,null,null,null,null,null,0,0,0,null,0,0,null,0,0,null,"no"]
[37,{"$f":"Coltura!C38","v":"E7"},{"$f":"Coltura!D38","v":"Cavolo abissino"},"nd","nd","nd",null,null,null,null,null,null,null,null,null,null,null,null,null,null,null,null,null,null,null,null,null,null,null,null,null,null,null,"nd",null,null,null,null,null,null,null,null,null,null,null,null,null,null,null,null,null,null,null,0,null,null,null,null,null,0,0,0,null,0,0,null,0,0,null,"no"]
[38,{"$f":"Coltura!C39","v":"E8"},{"$f":"Coltura!D39","v":"Cece"},"nd",2,40,70,90,50,90,80,120,40,120,1.6,10,20,0,15,0,15,15,0,20,10,0,0,0,20,20,0,0,0,2.4,10,20,0,0,15,30,20,0,0,0,0,0,30,20,10,0,0,0,0,30,20,0,0,0,0,20,0,0,null,0,0,null,0,0,null,"no"]
[39,{"$f":"Coltura!C40","v":"E9"},{"$f":"Coltura!D40","v":"Colza"},"nd",2.5,135,50,70,0,70,40,80,0,80,1.7,20,20,0,15,0,80,40,0,10,0,0,0,0,20,0,0,0,0,3.2,20,15,0,0,20,30,0,0,0,0,0,0,40,10,0,0,0,0,0,10,20,0,0,0,0,20,0,0,null,0,0,null,0,0,null,"no"]
[40,{"$f":"Coltura!C41","v":"E10"},{"$f":"Coltura!D41","v":"Colza pianta intera"},"nd",2.5,135,50,70,0,70,40,80,0,80,1.7,20,20,0,15,0,80,40,0,10,0,0,0,0,20,0,0,0,0,3.2,20,15,0,0,20,30,0,0,0,0,0,0,40,10,0,0,0,0,0,10,20,0,0,0,0,20,0,0,null,0,0,null,0,0,null,"no"]
[41,{"$f":"Coltura!C42","v":"E11"},{"$f":"Coltura!D42","v":"Farro"},"nd",2,40,30,50,0,50,40,60,0,60,1.5,15,20,0,15,15,40,40,0,10,0,0,0,0,20,0,0,0,0,2.5,15,15,0,0,15,30,0,10,0,0,0,0,30,10,0,0,30,0,0,40,20,0,0,0,0,20,0,0,null,0,0,null,0,0,null,"no"]
[42,{"$f":"Coltura!C43","v":"E12"},{"$f":"Coltura!D43","v":"Farro (pianta intera)"},"nd",2,40,30,50,0,50,40,60,0,60,1.5,15,20,0,15,0,80,40,0,10,0,0,0,0,20,0,0,0,0,2.5,15,15,0,0,15,30,0,10,0,0,0,0,30,10,0,0,30,0,0,40,20,0,0,0,0,20,0,0,null,0,0,null,0,0,null,"no"]
[43,{"$f":"Coltura!C44","v":"E13"},{"$f":"Coltura!D44","v":"Favino da granella"},"nd",2,0,70,90,50,90,90,120,40,120,1.6,10,20,0,15,0,40,15,0,20,10,0,0,0,20,30,0,0,0,2.4,10,20,0,0,15,30,0,0,0,0,0,0,40,20,10,0,0,0,0,30,20,0,0,0,0,20,0,0,null,0,0,null,0,0,null,"no"]
[44,{"$f":"Coltura!C45","v":"E14"},{"$f":"Coltura!D45","v":"Girasole (acheni)"},"nd",3,90,40,60,0,60,120,180,0,180,2.4,25,20,0,15,0,80,40,0,10,0,0,0,0,20,0,0,0,0,3.6,25,15,0,0,15,30,0,10,0,0,0,0,40,10,0,0,0,0,0,10,20,0,0,0,0,20,0,0,null,0,0,null,0,0,null,"no"]
[45,{"$f":"Coltura!C46","v":"E15"},{"$f":"Coltura!D46","v":"Girasole (pianta intera)"},"nd",3,90,40,60,0,60,120,180,0,180,2.4,25,20,0,15,0,80,40,0,10,0,0,0,0,20,0,0,0,0,3.6,25,15,0,0,15,30,0,10,0,0,0,0,40,10,0,0,0,0,0,10,20,0,0,0,0,20,0,0,null,0,0,null,0,0,null,"no"]
[46,{"$f":"Coltura!C47","v":"E16"},{"$f":"Coltura!D47","v":"Grano duro (granella)"},"nd",6,160,60,80,0,80,120,150,0,150,5,25,20,0,15,0,80,40,0,15,0,0,0,0,10,0,0,0,0,7,25,15,0,0,15,30,0,10,0,0,0,0,40,15,0,0,0,0,0,15,10,0,0,0,0,10,0,0,null,0,0,null,0,0,null,"no"]
[47,{"$f":"Coltura!C48","v":"E17"},{"$f":"Coltura!D48","v":"Grano duro (pianta intera)"},"nd",6,160,60,80,0,80,120,150,0,150,5,25,20,0,15,0,80,40,0,15,0,0,0,0,10,0,0,0,0,7,25,15,0,0,15,30,0,10,0,0,0,0,40,15,0,0,0,0,0,15,10,0,0,0,0,10,0,0,null,0,0,null,0,0,null,"no"]
[48,{"$f":"Coltura!C49","v":"E18"},{"$f":"Coltura!D49","v":"Grano tenero FP/FPS (granella)"},"nd",6,155,60,80,0,80,120,150,0,150,5,30,20,0,15,0,80,40,0,15,0,0,0,0,20,0,0,0,60,7,30,15,0,0,15,30,0,10,0,0,0,0,40,15,0,0,30,0,0,45,20,0,0,0,0,20,0,0,null,0,0,null,0,0,null,"no"]
[49,{"$f":"Coltura!C50","v":"E19"},{"$f":"Coltura!D50","v":"Grano tenero FP/FPS (pianta intera)"},"nd",6,155,60,80,0,80,120,150,0,150,5,30,20,0,15,0,80,40,0,15,0,0,0,0,20,0,0,0,60,7,30,15,0,0,15,30,0,10,0,0,0,0,40,15,0,0,30,0,0,45,20,0,0,0,0,20,0,0,null,0,0,null,0,0,null,"no"]
[50,{"$f":"Coltura!C51","v":"E20"},{"$f":"Coltura!D51","v":"Grano tenero biscottiero  (granella)"},"nd",6,140,60,80,0,80,120,150,0,150,5,30,20,0,15,0,80,40,0,15,0,0,0,0,20,0,0,0,60,7,30,15,0,0,15,30,0,10,0,0,0,0,40,15,0,0,30,0,0,45,20,0,0,0,0,20,0,0,null,0,0,null,0,0,null,"no"]
[51,{"$f":"Coltura!C52","v":"E21"},{"$f":"Coltura!D52","v":"Grano tenero biscottiero pianta intera"},"nd",6,140,60,80,0,80,120,150,0,150,5,30,20,0,15,0,80,40,0,15,0,0,0,0,20,0,0,0,60,7,30,15,0,0,15,30,0,10,0,0,0,0,40,15,0,0,30,0,0,45,20,0,0,0,0,20,0,0,null,0,0,null,0,0,null,"no"]
[52,{"$f":"Coltura!C53","v":"E22"},{"$f":"Coltura!D53","v":"Grano tenero FF (granella)"},"nd",6,160,60,80,0,80,120,150,0,150,5,30,20,0,15,0,80,40,0,15,0,0,0,0,20,0,0,0,60,7,30,15,0,0,15,30,0,10,0,0,0,0,40,15,0,0,30,0,0,45,20,0,0,0,0,20,0,0,null,0,0,null,0,0,null,"no"]
[53,{"$f":"Coltura!C54","v":"E23"},{"$f":"Coltura!D54","v":"Grano tenero FF (pianta intera)"},"nd",6,160,60,80,0,80,120,150,0,150,5,30,20,0,15,0,80,40,0,15,0,0,0,0,20,0,0,0,60,7,30,15,0,0,15,30,0,10,0,0,0,0,40,15,0,0,30,0,0,45,20,0,0,0,0,20,0,0,null,0,0,null,0,0,null,"no"]
[54,{"$f":"Coltura!C55","v":"E24"},{"$f":"Coltura!D55","v":"Lenticchia"},"nd","nd","nd",null,null,null,null,null,null,null,null,null,null,null,null,null,null,null,null,null,null,null,null,null,null,null,null,null,null,null,"nd",null,null,null,null,null,null,null,null,null,null,null,null,null,null,null,null,null,null,null,0,null,null,null,null,null,0,0,0,null,0,0,null,0,0,null,"no"]
[55,{"$f":"Coltura!C56","v":"E25"},{"$f":"Coltura!D56","v":"Lino  fibra"},"nd","nd","nd",null,null,null,null,null,null,null,null,null,null,null,null,null,null,null,null,null,null,null,null,null,null,null,null,null,null,null,"nd",null,null,null,null,null,null,null,null,null,null,null,null,null,null,null,null,null,null,null,0,null,null,null,null,null,0,0,0,null,0,0,null,0,0,null,"no"]
[56,{"$f":"Coltura!C57","v":"E26"},{"$f":"Coltura!D57","v":"Lino granella"},"nd","nd","nd",null,null,null,null,null,null,null,null,null,null,null,null,null,null,null,null,null,null,null,null,null,null,null,null,null,null,null,"nd",null,null,null,null,null,null,null,null,null,null,null,null,null,null,null,null,null,null,null,0,null,null,null,null,null,0,0,0,null,0,0,null,0,0,null,"no"]
[57,{"$f":"Coltura!C58","v":"E27"},{"$f":"Coltura!D58","v":"Lupino"},"nd","nd","nd",null,null,null,null,null,null,null,null,null,null,null,null,null,null,null,null,null,null,null,null,null,null,null,null,null,null,null,"nd",null,null,null,null,null,null,null,null,null,null,null,null,null,null,null,null,null,null,null,0,null,null,null,null,null,0,0,0,null,0,0,null,0,0,null,"no"]
[58,{"$f":"Coltura!C59","v":"E28"},{"$f":"Coltura!D59","v":"Mais da granella 300-400 (granella)"},"nd",7,150,50,70,0,70,40,80,0,80,5.5,30,20,0,15,0,80,40,0,15,0,0,0,0,20,0,0,0,0,8.5,30,15,0,0,15,30,0,10,0,0,0,0,70,15,0,0,0,0,0,15,20,0,0,0,0,20,0,0,null,0,0,null,0,0,null,"no"]
[59,{"$f":"Coltura!C60","v":"E29"},{"$f":"Coltura!D60","v":"Mais da granella 300-400 (pianta intera)"},"nd",7,150,50,70,0,70,90,130,0,130,5.5,30,20,0,15,0,80,40,0,15,0,0,0,0,20,0,0,0,0,8.5,30,15,0,0,15,30,0,10,0,0,0,0,70,15,0,0,0,0,0,15,20,0,0,0,0,20,0,0,null,0,0,null,0,0,null,"no"]
[60,{"$f":"Coltura!C61","v":"E30"},{"$f":"Coltura!D61","v":"Mais da granella 500-700 (granella)"},"nd",12,240,80,100,0,100,75,150,0,150,10,30,20,0,15,0,80,40,0,15,0,0,0,0,20,0,0,0,0,14,30,15,0,0,15,30,0,10,0,0,0,0,70,15,0,0,0,0,0,15,20,0,0,0,0,20,0,0,null,0,0,null,0,0,null,"no"]
[61,{"$f":"Coltura!C62","v":"E31"},{"$f":"Coltura!D62","v":"Mais da granella 500-700 (pianta intera)"},"nd",12,240,80,100,0,100,155,230,80,230,10,30,20,0,15,0,80,40,0,15,0,0,0,0,20,0,0,0,0,14,30,15,0,0,15,30,0,10,0,0,0,0,70,15,0,0,0,0,0,15,20,0,0,0,0,20,0,0,null,0,0,null,0,0,null,"no"]
[62,{"$f":"Coltura!C63","v":"E32"},{"$f":"Coltura!D63","v":"Mais dolce  (spighe)"},"nd",16,170,150,220,50,220,140,210,60,210,13,20,20,0,15,0,15,15,0,30,10,0,0,0,30,30,0,0,0,19,20,20,0,0,15,30,20,20,30,0,0,0,40,30,10,10,0,0,0,50,30,0,0,0,0,30,0,0,null,0,0,null,0,0,null,"no"]
[63,{"$f":"Coltura!C64","v":"E33"},{"$f":"Coltura!D64","v":"Mais dolce (pianta intera)"},"nd",16,170,150,220,50,220,140,210,60,210,13,20,20,0,15,0,15,15,0,30,10,0,0,0,30,30,0,0,0,19,20,20,0,0,15,30,20,20,30,0,0,0,40,30,10,10,0,0,0,50,30,0,0,0,0,30,0,0,null,0,0,null,0,0,null,"no"]
[64,{"$f":"Coltura!C65","v":"E34"},{"$f":"Coltura!D65","v":"Mais trinciato classe 500"},"nd",45,150,50,70,0,70,90,130,50,130,36,30,20,0,15,0,80,40,0,15,0,0,0,0,20,0,0,0,0,54,30,15,0,0,15,30,0,10,0,0,0,0,50,15,0,0,0,0,0,15,20,0,0,0,0,20,0,0,null,0,0,null,0,0,null,"no"]
[65,{"$f":"Coltura!C66","v":"E35"},{"$f":"Coltura!D66","v":"Mais trinciato classe 700"},"nd",65,240,80,100,0,100,155,230,80,230,55,30,20,0,15,0,80,40,0,15,0,0,0,0,20,0,0,0,0,75,30,15,0,0,15,30,0,10,0,0,0,0,70,15,0,0,0,0,0,15,20,0,0,0,0,20,0,0,null,0,0,null,0,0,null,"no"]
[66,{"$f":"Coltura!C67","v":"E36"},{"$f":"Coltura!D67","v":"Orzo (granella)"},"nd",6.5,125,60,90,0,90,120,150,0,150,5.2,25,20,0,15,0,80,40,0,15,0,0,0,0,20,0,0,0,0,7.8,25,15,0,0,15,30,0,10,0,0,0,0,40,15,0,0,0,0,0,15,20,0,0,0,0,20,0,0,null,0,0,null,0,0,null,"no"]
[67,{"$f":"Coltura!C68","v":"E37"},{"$f":"Coltura!D68","v":"Orzo (pianta intera)"},"nd",6.5,125,60,90,0,90,120,150,0,150,5.2,25,20,0,15,0,80,40,0,15,0,0,0,0,20,0,0,0,0,7.8,25,15,0,0,15,30,0,10,0,0,0,0,40,15,0,0,0,0,0,15,20,0,0,0,0,20,0,0,null,0,0,null,0,0,null,"no"]
[{"$f":"(A70+1)","v":68},{"$f":"Coltura!C69","v":"E38"},{"$f":"Coltura!D69","v":"Panico"},"nd","nd","nd",null,null,null,null,null,null,null,null,null,null,null,null,null,null,null,null,null,null,null,null,null,null,null,null,null,null,null,"nd",null,null,null,null,null,null,null,null,null,null,null,null,null,null,null,null,null,null,null,0,null,null,null,null,null,0,0,0,null,0,0,null,0,0,null,"no"]
[69,{"$f":"Coltura!C70","v":"E39"},{"$f":"Coltura!D70","v":"Pisello proteico"},"nd",5,40,50,100,0,100,50,150,0,150,4,10,15,10,15,0,10,10,0,10,0,0,0,0,20,0,0,0,0,6,10,10,10,0,15,0,0,0,0,0,0,0,20,10,10,0,0,0,0,20,20,0,0,0,0,20,0,0,null,0,0,null,0,0,null,"no"]
[70,{"$f":"Coltura!C71","v":"E40"},{"$f":"Coltura!D71","v":"Pisello proteico + residui"},"nd",5,40,50,100,0,100,50,150,0,150,4,10,15,10,15,0,10,10,0,10,0,0,0,0,20,0,0,0,0,6,10,10,10,0,15,0,0,0,0,0,0,0,20,10,10,0,0,0,0,20,20,0,0,0,0,20,0,0,null,0,0,null,0,0,null,"no"]
[71,{"$f":"Coltura!C72","v":"E41"},{"$f":"Coltura!D72","v":"Rafano (da sovescio)"},"nd","nd","nd",null,null,null,null,null,null,null,null,null,null,null,null,null,null,null,null,null,null,null,null,null,null,null,null,null,null,null,"nd",null,null,null,null,null,null,null,null,null,null,null,null,null,null,null,null,null,null,null,0,null,null,null,null,null,0,0,0,null,0,0,null,0,0,null,"no"]
[72,{"$f":"Coltura!C73","v":"E42"},{"$f":"Coltura!D73","v":"Riso (granella)"},"nd",7,110,50,100,0,100,60,90,0,90,5.6,25,20,0,15,15,0,0,0,15,0,0,0,0,25,0,0,0,0,8.4,25,15,0,0,15,0,0,0,0,0,0,0,40,15,0,0,0,0,0,15,25,0,0,0,0,25,0,0,null,0,0,null,0,0,null,"no"]
[73,{"$f":"Coltura!C74","v":"E43"},{"$f":"Coltura!D74","v":"Riso (granella+paglia)"},"nd",7,110,50,100,0,100,120,180,0,180,5.6,25,20,0,15,15,0,0,0,15,0,0,0,0,25,0,0,0,0,8.4,25,15,0,0,15,0,0,0,0,0,0,0,40,15,0,0,0,0,0,15,25,0,0,0,0,25,0,0,null,0,0,null,0,0,null,"no"]
[74,{"$f":"Coltura!C75","v":"E44"},{"$f":"Coltura!D75","v":"Segale (granella)"},"nd",4,100,50,100,0,100,50,100,0,100,3,30,20,0,15,15,80,40,0,12,0,0,0,0,30,0,0,0,0,5,30,15,0,0,15,30,0,10,0,0,0,0,50,12,0,0,0,0,0,12,30,0,0,0,0,30,0,0,null,0,0,null,0,0,null,"no"]
[75,{"$f":"Coltura!C76","v":"E45"},{"$f":"Coltura!D76","v":"Segale pianta intera"},"nd",4,100,50,100,0,100,100,150,0,150,3,30,20,0,15,15,80,40,0,12,0,0,0,0,30,0,0,0,0,5,30,15,0,0,15,30,0,10,0,0,0,0,50,12,0,0,0,0,0,12,30,0,0,0,0,30,0,0,null,0,0,null,0,0,null,"no"]
[76,{"$f":"Coltura!C77","v":"E46"},{"$f":"Coltura!D77","v":"Senape indiana"},"nd","nd","nd",null,null,null,null,null,null,null,null,null,null,null,null,null,null,null,null,null,null,null,null,null,null,null,null,null,null,null,"nd",null,null,null,null,null,null,null,null,null,null,null,null,null,null,null,null,null,null,null,0,null,null,null,null,null,0,0,0,null,0,0,null,0,0,null,"no"]
[77,{"$f":"Coltura!C78","v":"E47"},{"$f":"Coltura!D78","v":"Soia (granella)"},"nd",3.5,0,50,100,0,100,80,120,0,120,2.8,0,0,0,0,0,0,0,0,10,0,0,0,0,20,0,0,0,0,4.2,0,0,0,0,0,0,120,0,0,0,0,0,120,10,0,0,0,0,0,10,20,0,0,0,0,20,0,0,null,0,0,null,0,0,null,"no"]
[78,{"$f":"Coltura!C79","v":"E48"},{"$f":"Coltura!D79","v":"Soia (pianta intera)"},"nd",3.5,0,50,100,0,100,80,120,0,120,2.8,0,0,0,0,0,0,0,0,10,0,0,0,0,20,0,0,0,0,4.2,0,0,0,0,0,0,120,0,0,0,0,0,120,10,0,0,0,0,0,10,20,0,0,0,0,20,0,0,null,0,0,null,0,0,null,"no"]
[79,{"$f":"Coltura!C80","v":"E49"},{"$f":"Coltura!D80","v":"Sorgo da foraggio"},"nd","nd","nd",null,null,null,null,null,null,null,null,null,null,20,null,null,null,null,null,null,null,null,null,null,null,null,null,null,null,null,"nd",null,null,null,null,null,null,null,null,null,null,null,null,null,null,null,null,null,null,null,0,null,null,null,null,null,0,0,0,null,0,0,null,0,0,null,"no"]
[80,{"$f":"Coltura!C81","v":"E50"},{"$f":"Coltura!D81","v":"Sorgo da granella  (solo granella)"},"nd",7.5,160,50,80,0,80,50,100,0,100,6,25,20,0,15,0,80,40,0,15,0,0,0,0,10,0,0,0,0,9,25,15,0,0,15,30,0,10,0,0,0,0,30,15,0,0,0,0,0,15,10,0,0,0,0,10,0,0,null,0,0,null,0,0,null,"no"]
[81,{"$f":"Coltura!C82","v":"E51"},{"$f":"Coltura!D82","v":"Sorgo da granella (pianta intera)"},"nd",7.5,160,50,80,0,80,50,100,0,100,6,25,20,0,15,0,80,40,0,15,0,0,0,0,10,0,0,0,0,9,25,15,0,0,15,30,0,10,0,0,0,0,30,15,0,0,0,0,0,15,10,0,0,0,0,10,0,0,null,0,0,null,0,0,null,"no"]
[82,{"$f":"Coltura!C83","v":"E52"},{"$f":"Coltura!D83","v":"Tabacco Bright"},"nd","nd","nd",null,null,null,null,null,null,null,null,null,null,null,null,null,null,null,null,null,null,null,null,null,null,null,null,null,null,null,"nd",null,null,null,null,null,null,null,null,null,null,null,null,null,null,null,null,null,null,null,0,null,null,null,null,null,0,0,0,null,0,0,null,0,0,null,"no"]
[83,{"$f":"Coltura!C84","v":"E53"},{"$f":"Coltura!D84","v":"Tabacco Bright pianta intera"},"nd","nd","nd",null,null,null,null,null,null,null,null,null,null,null,null,null,null,null,null,null,null,null,null,null,null,null,null,null,null,null,"nd",null,null,null,null,null,null,null,null,null,null,null,null,null,null,null,null,null,null,null,0,null,null,null,null,null,0,0,0,null,0,0,null,0,0,null,"no"]
[84,{"$f":"Coltura!C85","v":"E54"},{"$f":"Coltura!D85","v":"Tabacco Burley"},"nd","nd","nd",null,null,null,null,null,null,null,null,null,null,null,null,null,null,null,null,null,null,null,null,null,null,null,null,null,null,null,"nd",null,null,null,null,null,null,null,null,null,null,null,null,null,null,null,null,null,null,null,0,null,null,null,null,null,0,0,0,null,0,0,null,0,0,null,"no"]
[85,{"$f":"Coltura!C86","v":"E55"},{"$f":"Coltura!D86","v":"Tabacco Burley pianta intera"},"nd","nd","nd",null,null,null,null,null,null,null,null,null,null,null,null,null,null,null,null,null,null,null,null,null,null,null,null,null,null,null,"nd",null,null,null,null,null,null,null,null,null,null,null,null,null,null,null,null,null,null,null,0,null,null,null,null,null,0,0,0,null,0,0,null,0,0,null,"no"]
[86,{"$f":"Coltura!C87","v":"E56"},{"$f":"Coltura!D87","v":"Triticale"},"nd",7.5,140,50,100,0,100,75,125,0,125,6.5,30,20,0,15,15,80,40,0,12,0,0,0,0,30,0,0,0,0,8.5,30,15,0,0,15,30,0,10,0,0,0,0,50,12,0,0,0,0,0,12,30,0,0,0,0,30,0,0,null,0,0,null,0,0,null,"no"]
[87,{"$f":"Coltura!C88","v":"E57"},{"$f":"Coltura!D88","v":"Triticale pianta intera"},"nd",7.5,140,50,100,0,100,125,175,0,175,6.5,30,20,0,15,15,80,40,0,12,0,0,0,0,30,0,0,0,0,8.5,30,15,0,0,15,30,0,10,0,0,0,0,50,12,0,0,0,0,0,12,30,0,0,0,0,30,0,0,null,0,0,null,0,0,null,"no"]
[88,{"$f":"Coltura!C89","v":"F1"},{"$f":"Coltura!D89","v":"Avena insilata"},"nd","nd","nd",null,null,null,null,null,null,null,null,null,null,null,null,null,null,null,null,null,null,null,null,null,null,null,null,null,null,null,"nd",null,null,null,null,null,null,null,null,null,null,null,null,null,null,null,null,null,null,null,0,null,null,null,null,null,0,0,0,null,0,0,null,0,0,null,"no"]
[89,{"$f":"Coltura!C90","v":"F2"},{"$f":"Coltura!D90","v":"Colza insilato"},"nd","nd","nd",null,null,null,null,null,null,null,null,null,null,null,null,null,null,null,null,null,null,null,null,null,null,null,null,null,null,null,"nd",null,null,null,null,null,null,null,null,null,null,null,null,null,null,null,null,null,null,null,0,null,null,null,null,null,0,0,0,null,0,0,null,0,0,null,"no"]
[90,{"$f":"Coltura!C91","v":"F3"},{"$f":"Coltura!D91","v":"Erba mazzolina"},"nd",12.5,200,75,100,0,100,150,200,0,200,11,40,20,0,15,0,0,0,0,15,0,0,0,0,50,0,0,0,0,15,40,15,0,0,20,0,0,10,0,0,0,0,50,15,0,0,0,0,0,15,50,0,0,0,0,50,0,0,null,0,0,null,0,0,null,"no"]
[91,{"$f":"Coltura!C92","v":"F4"},{"$f":"Coltura!D92","v":"Erba medica"},"nd",12.5,0,60,100,0,100,150,200,0,200,11,0,0,0,0,0,0,0,0,15,0,0,0,0,50,0,0,0,0,15,0,0,0,0,0,0,0,0,0,0,100,0,100,15,0,0,0,0,0,15,50,0,0,0,0,50,0,0,null,0,0,null,0,0,null,"no"]
[92,{"$f":"Coltura!C93","v":"F5"},{"$f":"Coltura!D93","v":"Erbai aut prim. Di cer. O cruc."},"nd","nd","nd",null,null,null,null,null,null,null,null,null,null,null,null,null,null,null,null,null,null,null,null,null,null,null,null,null,null,null,"nd",null,null,null,null,null,null,null,null,null,null,null,null,null,null,null,null,null,null,null,0,null,null,null,null,null,0,0,0,null,0,0,null,0,0,null,"no"]
[93,{"$f":"Coltura!C94","v":"F6"},{"$f":"Coltura!D94","v":"Erbai aut prim. Di leguminose"},"nd","nd","nd",null,null,null,null,null,null,null,null,null,null,null,null,null,null,null,null,null,null,null,null,null,null,null,null,null,null,null,"nd",null,null,null,null,null,null,null,null,null,null,null,null,null,null,null,null,null,null,null,0,null,null,null,null,null,0,0,0,null,0,0,null,0,0,null,"no"]
[94,{"$f":"Coltura!C95","v":"F7"},{"$f":"Coltura!D95","v":"Erbai biennali o Prati avv. di Graminacee"},"nd","nd","nd",null,null,null,null,null,null,null,null,null,null,null,null,null,null,null,null,null,null,null,null,null,null,null,null,null,null,null,"nd",null,null,null,null,null,null,null,null,null,null,null,null,null,null,null,null,null,null,null,0,null,null,null,null,null,0,0,0,null,0,0,null,0,0,null,"no"]
[95,{"$f":"Coltura!C96","v":"F8"},{"$f":"Coltura!D96","v":"Erbai biennali misti o Prati avv. Polifita"},"nd","nd","nd",null,null,null,null,null,null,null,null,null,null,null,null,null,null,null,null,null,null,null,null,null,null,null,null,null,null,null,"nd",null,null,null,null,null,null,null,null,null,null,null,null,null,null,null,null,null,null,null,0,null,null,null,null,null,0,0,0,null,0,0,null,0,0,null,"no"]
[96,{"$f":"Coltura!C97","v":"F9"},{"$f":"Coltura!D97","v":"Farro insilato"},"nd","nd","nd",null,null,null,null,null,null,null,null,null,null,null,null,null,null,null,null,null,null,null,null,null,null,null,null,null,null,null,"nd",null,null,null,null,null,null,null,null,null,null,null,null,null,null,null,null,null,null,null,0,null,null,null,null,null,0,0,0,null,0,0,null,0,0,null,"no"]
[97,{"$f":"Coltura!C98","v":"F10"},{"$f":"Coltura!D98","v":"Festuca arundinacea"},"nd",12.5,200,75,100,0,100,150,200,0,200,11,40,20,0,15,0,0,0,0,15,0,0,0,0,50,0,0,0,0,15,40,15,0,0,20,0,0,10,0,0,0,0,50,15,0,0,0,0,0,15,50,0,0,0,0,50,0,0,null,0,0,null,0,0,null,"no"]
[98,{"$f":"Coltura!C99","v":"F11"},{"$f":"Coltura!D99","v":"Fleolo (coda di topo)"},"nd","nd","nd",null,null,null,null,null,null,null,null,null,null,null,null,null,null,null,null,null,null,null,null,null,null,null,null,null,null,null,"nd",null,null,null,null,null,null,null,null,null,null,null,null,null,null,null,null,null,null,null,0,null,null,null,null,null,0,0,0,null,0,0,null,0,0,null,"no"]
[99,{"$f":"Coltura!C100","v":"F12"},{"$f":"Coltura!D100","v":"Grano duro  insilato"},"nd","nd","nd",null,null,null,null,null,null,null,null,null,null,null,null,null,null,null,null,null,null,null,null,null,null,null,null,null,null,null,"nd",null,null,null,null,null,null,null,null,null,null,null,null,null,null,null,null,null,null,null,0,null,null,null,null,null,0,0,0,null,0,0,null,0,0,null,"no"]
[100,{"$f":"Coltura!C101","v":"F13"},{"$f":"Coltura!D101","v":"Grano tenero  insilato"},"nd","nd","nd",null,null,null,null,null,null,null,null,null,null,null,null,null,null,null,null,null,null,null,null,null,null,null,null,null,null,null,"nd",null,null,null,null,null,null,null,null,null,null,null,null,null,null,null,null,null,null,null,0,null,null,null,null,null,0,0,0,null,0,0,null,0,0,null,"no"]
[101,{"$f":"Coltura!C102","v":"F14"},{"$f":"Coltura!D102","v":"Loglio da insilare"},"nd","nd","nd",null,null,null,null,null,null,null,null,null,null,null,null,null,null,null,null,null,null,null,null,null,null,null,null,null,null,null,"nd",null,null,null,null,null,null,null,null,null,null,null,null,null,null,null,null,null,null,null,0,null,null,null,null,null,0,0,0,null,0,0,null,0,0,null,"no"]
[102,{"$f":"Coltura!C103","v":"F15"},{"$f":"Coltura!D103","v":"Loiessa"},"nd","nd","nd",null,null,null,null,null,null,null,null,null,null,null,null,null,null,null,null,null,null,null,null,null,null,null,null,null,null,null,"nd",null,null,null,null,null,null,null,null,null,null,null,null,null,null,null,null,null,null,null,0,null,null,null,null,null,0,0,0,null,0,0,null,0,0,null,"no"]
[103,{"$f":"Coltura!C104","v":"F16"},{"$f":"Coltura!D104","v":"Loietto perenne"},"nd","nd","nd",null,null,null,null,null,null,null,null,null,null,null,null,null,null,null,null,null,null,null,null,null,null,null,null,null,null,null,"nd",null,null,null,null,null,null,null,null,null,null,null,null,null,null,null,null,null,null,null,0,null,null,null,null,null,0,0,0,null,0,0,null,0,0,null,"no"]
[104,{"$f":"Coltura!C105","v":"F17"},{"$f":"Coltura!D105","v":"Orzo insilato"},"nd","nd","nd",null,null,null,null,null,null,null,null,null,null,null,null,null,null,null,null,null,null,null,null,null,null,null,null,null,null,null,"nd",null,null,null,null,null,null,null,null,null,null,null,null,null,null,null,null,null,null,null,0,null,null,null,null,null,0,0,0,null,0,0,null,0,0,null,"no"]
[105,{"$f":"Coltura!C106","v":"F18"},{"$f":"Coltura!D106","v":"Prati di graminacee"},"nd","nd","nd",null,null,null,null,null,null,null,null,null,null,null,null,null,null,null,null,null,null,null,null,null,null,null,null,null,null,null,"nd",null,null,null,null,null,null,null,null,null,null,null,null,null,null,null,null,null,null,null,0,null,null,null,null,null,0,0,0,null,0,0,null,0,0,null,"no"]
[106,{"$f":"Coltura!C107","v":"F19"},{"$f":"Coltura!D107","v":"Prati di trifoglio"},"nd","nd","nd",null,null,null,null,null,null,null,null,null,null,null,null,null,null,null,null,null,null,null,null,null,null,null,null,null,null,null,"nd",null,null,null,null,null,null,null,null,null,null,null,null,null,null,null,null,null,null,null,0,null,null,null,null,null,0,0,0,null,0,0,null,0,0,null,"no"]
[107,{"$f":"Coltura!C108","v":"F20"},{"$f":"Coltura!D108","v":"Prati pascoli in collina"},"nd","nd","nd",null,null,null,null,null,null,null,null,null,null,null,null,null,null,null,null,null,null,null,null,null,null,null,null,null,null,null,"nd",null,null,null,null,null,null,null,null,null,null,null,null,null,null,null,null,null,null,null,0,null,null,null,null,null,0,0,0,null,0,0,null,0,0,null,"no"]
[108,{"$f":"Coltura!C109","v":"F21"},{"$f":"Coltura!D109","v":"Prati polifiti >50% leguminose"},"nd","nd","nd",null,null,null,null,null,null,null,null,null,null,null,null,null,null,null,null,null,null,null,null,null,null,null,null,null,null,null,"nd",null,null,null,null,null,null,null,null,null,null,null,null,null,null,null,null,null,null,null,0,null,null,null,null,null,0,0,0,null,0,0,null,0,0,null,"no"]
[109,{"$f":"Coltura!C110","v":"F22"},{"$f":"Coltura!D110","v":"Prati polifiti"},"nd",8.5,155,50,100,0,100,150,200,0,200,7,30,20,0,15,0,0,0,0,15,0,0,0,0,40,0,0,0,0,10,30,15,0,0,20,0,0,10,0,0,0,0,45,15,0,0,0,0,0,15,40,0,0,0,0,40,0,0,null,0,0,null,0,0,null,"no"]
[110,{"$f":"Coltura!C111","v":"F23"},{"$f":"Coltura!D111","v":"Prati stabili in pianura"},"nd",13,140,80,80,0,0,300,300,0,300,10.4,0,20,0,0,0,0,0,0,20,0,0,0,0,50,0,0,0,0,15.6,0,0,0,0,20,0,0,0,0,0,0,0,20,20,0,0,0,0,0,20,50,0,0,0,0,50,0,0,null,0,0,null,0,0,null,"no"]
[111,{"$f":"Coltura!C112","v":"F24"},{"$f":"Coltura!D112","v":"Prato misto"},"nd","nd","nd",null,null,null,null,null,null,null,null,null,null,null,null,null,null,null,null,null,null,null,null,null,null,null,null,null,null,null,"nd",null,null,null,null,null,null,null,null,null,null,null,null,null,null,null,null,null,null,null,0,null,null,null,null,null,0,0,0,null,0,0,null,0,0,null,"no"]
[112,{"$f":"Coltura!C113","v":"F25"},{"$f":"Coltura!D113","v":"Segale insilato"},"nd","nd","nd",null,null,null,null,null,null,null,null,null,null,null,null,null,null,null,null,null,null,null,null,null,null,null,null,null,null,null,"nd",null,null,null,null,null,null,null,null,null,null,null,null,null,null,null,null,null,null,null,0,null,null,null,null,null,0,0,0,null,0,0,null,0,0,null,"no"]
[113,{"$f":"Coltura!C114","v":"F26"},{"$f":"Coltura!D114","v":"Triticale insilato"},"nd","nd","nd",null,null,null,null,null,null,null,null,null,null,null,null,null,null,null,null,null,null,null,null,null,null,null,null,null,null,null,"nd",null,null,null,null,null,null,null,null,null,null,null,null,null,null,null,null,null,null,null,0,null,null,null,null,null,0,0,0,null,0,0,null,0,0,null,"no"]
[114,{"$f":"Coltura!C115","v":"O1"},{"$f":"Coltura!D115","v":"Aglio"},"nd",9,110,75,100,50,100,130,180,70,180,7,25,20,0,15,0,15,15,0,15,0,0,0,0,20,0,0,0,0,11,25,15,0,0,20,30,0,20,0,0,0,0,60,15,10,0,0,0,0,25,20,0,0,0,0,20,0,0,null,0,0,null,0,0,null,"no"]
[115,{"$f":"Coltura!C116","v":"O2"},{"$f":"Coltura!D116","v":"Asparago verde (pianta intera)"},"nd",8,160,100,150,50,150,160,240,60,240,5.5,20,20,0,15,0,0,0,0,20,10,0,0,0,30,30,0,0,0,8.5,20,20,0,0,15,0,20,0,0,0,0,0,30,20,10,0,0,0,0,30,30,0,0,0,0,30,0,0,null,0,0,null,0,0,null,"no"]
[116,{"$f":"Coltura!C117","v":"O3"},{"$f":"Coltura!D117","v":"Basilico media produzione"},"nd",20,100,70,90,50,90,80,120,40,120,16,30,20,0,20,0,20,20,0,15,15,0,0,0,15,30,0,0,0,24,30,20,0,0,15,30,20,0,0,0,0,0,40,15,10,0,0,0,0,25,15,0,0,0,0,15,0,0,null,0,0,null,0,0,null,"no"]
[117,{"$f":"Coltura!C118","v":"O4"},{"$f":"Coltura!D118","v":"Basilico alta produzione più tagli"},"nd",55,{"$f":"IF($BR120=\"sì\",(BS120+(BU120*(Codici!$BA$2-1))))","v":120},80,100,40,100,{"$f":"IF($BR120=\"sì\",(BW120+(CA120*(Codici!$BA$2-1))))","v":130},{"$f":"IF($BR120=\"sì\",(BX120+(CB120*(Codici!$BA$2-1))))","v":190},{"$f":"IF($BR120=\"sì\",(BY120+(CC120*(Codici!$BA$2-1))))","v":60},{"$f":"IF($BR120=\"sì\",(BZ120+(CD120*(Codici!$BA$2-1))))","v":190},50,0,20,0,20,0,20,20,0,10,0,0,0,0,0,0,0,0,0,60,0,20,0,0,15,20,0,0,0,0,0,0,40,10,0,0,0,0,0,0,0,0,0,0,0,0,0,0,null,0,0,null,0,0,null,"sì",90,{"$f":"IF(Codici!BA2>1,\"comprensivo di tutti i tagli\",\"\")","v":"comprensivo di tutti i tagli"},30,"dose per tagli successivi",100,150,50,150,30,40,10,40]
[118,{"$f":"Coltura!C119","v":"O5"},{"$f":"Coltura!D119","v":"Bietola da costa e da foglia m. fresco  media produzione"},"nd",25,150,100,120,30,120,130,200,50,200,20,20,0,0,20,0,20,20,0,10,0,0,0,0,25,0,0,0,0,30,20,20,0,0,15,20,0,0,0,0,0,0,40,10,20,0,0,20,0,50,25,0,0,0,0,25,0,0,null,0,0,null,0,0,null,"no"]
[119,{"$f":"Coltura!C120","v":"O6"},{"$f":"Coltura!D120","v":"Bietola da costa e da foglia m. fresco  alta produzione più tagli"},"nd",35,{"$f":"IF($BR122=\"sì\",(BS122+(BU122*(Codici!$BA$2-1))))","v":240},100,120,30,120,{"$f":"IF($BR122=\"sì\",(BW122+(CA122*(Codici!$BA$2-1))))","v":175},{"$f":"IF($BR122=\"sì\",(BX122+(CB122*(Codici!$BA$2-1))))","v":245},50,{"$f":"IF($BR122=\"sì\",(BZ122+(CD122*(Codici!$BA$2-1))))","v":245},20,0,0,0,20,0,20,20,0,10,0,0,0,0,25,0,0,0,0,30,0,20,0,0,15,20,0,0,0,0,0,0,40,10,20,0,0,20,0,50,25,0,0,0,0,25,0,0,null,0,0,null,0,0,null,"sì",200,"comprensivo di tutti i tagli",40,"dose per tagli successivi",175,245,45,245,0,0,0,0]
[120,{"$f":"Coltura!C121","v":"O7"},{"$f":"Coltura!D121","v":"Bietola da foglie per l'industria media produzione più tagli"},"nd",25,{"$f":"IF($BR123=\"sì\",(BS123+(BU123*(Codici!$BA$2-1))))","v":190},100,120,30,120,{"$f":"IF($BR123=\"sì\",(BW123+(CA123*(Codici!$BA$2-1))))","v":130},{"$f":"IF($BR123=\"sì\",(BX123+(CB123*(Codici!$BA$2-1))))","v":200},{"$f":"IF($BR123=\"sì\",(BY123+(CC123*(Codici!$BA$2-1))))","v":50},{"$f":"IF($BR123=\"sì\",(BZ123+(CD123*(Codici!$BA$2-1))))","v":200},20,0,20,0,20,0,20,20,0,10,0,0,0,0,25,0,0,0,0,30,0,20,0,0,15,20,0,0,0,0,0,0,40,10,20,0,0,20,0,50,25,0,0,0,0,25,0,0,null,0,0,null,0,0,null,"sì",150,"comprensivo di tutti i tagli",40,"dose per tagli successivi",130,200,50,200,0,0,0,0]
[121,{"$f":"Coltura!C122","v":"O8"},{"$f":"Coltura!D122","v":"Bietola da costa per l'industria alta produzione più tagli"},"nd",35,{"$f":"IF($BR124=\"sì\",(BS124+(BU124*(Codici!$BA$2-1))))","v":240},100,120,30,120,{"$f":"IF($BR124=\"sì\",(BW124+(CA124*(Codici!$BA$2-1))))","v":200},{"$f":"IF($BR124=\"sì\",(BX124+(CB124*(Codici!$BA$2-1))))","v":270},{"$f":"IF($BR124=\"sì\",(BY124+(CC124*(Codici!$BA$2-1))))","v":70},{"$f":"IF($BR124=\"sì\",(BZ124+(CD124*(Codici!$BA$2-1))))","v":270},30,0,20,0,20,0,20,20,0,10,0,0,0,0,25,0,0,0,0,40,0,20,0,0,15,20,0,0,0,0,0,0,40,10,20,0,0,20,0,50,25,0,0,0,0,25,0,0,null,0,0,null,0,0,null,"sì",200,"comprensivo di tutti i tagli",40,"dose per tagli successivi",200,270,70,270,0,0,0,0]
[122,{"$f":"Coltura!C123","v":"O9"},{"$f":"Coltura!D123","v":"Broccoletto  - Cime di rapa"},"nd","nd","nd",null,null,null,null,null,null,null,null,null,null,null,null,null,null,null,null,null,null,null,null,null,null,null,null,null,null,null,"nd",null,null,null,null,null,null,null,null,null,null,null,null,null,null,null,null,null,null,null,0,null,null,null,null,null,0,0,0,null,0,0,null,0,0,null,"no"]
[123,{"$f":"Coltura!C124","v":"O10"},{"$f":"Coltura!D124","v":"Broccolo media produzione"},"nd",20,130,80,120,30,120,100,120,30,120,16,20,20,0,20,0,0,0,0,20,10,0,0,0,20,30,0,0,0,24,20,20,0,0,15,30,20,20,0,0,0,0,50,20,10,0,0,0,0,30,20,0,0,0,0,20,0,0,null,0,0,null,0,0,null,"no"]
[124,{"$f":"Coltura!C125","v":"O11"},{"$f":"Coltura!D125","v":"Broccolo alta produzione"},"nd",32.5,160,80,120,30,120,130,150,30,150,30,20,20,0,20,0,0,0,0,20,10,0,0,0,20,30,0,0,0,35,20,20,0,0,15,30,20,20,0,0,0,0,50,20,10,0,0,0,0,30,20,0,0,0,0,20,0,0,null,0,0,null,0,0,null,"no"]
[125,{"$f":"Coltura!C126","v":"O12"},{"$f":"Coltura!D126","v":"Cappuccio media produzione"},"nd",27,150,80,120,30,120,150,200,30,200,22,25,20,0,20,0,0,0,0,15,10,0,0,0,30,30,0,0,0,32,25,20,0,0,15,30,20,0,0,0,0,0,40,15,10,0,0,0,0,25,30,0,0,0,0,30,0,0,null,0,0,null,0,0,null,"no"]
[126,{"$f":"Coltura!C127","v":"O13"},{"$f":"Coltura!D127","v":"Cappuccio alta produzione"},"nd",50,180,80,120,30,120,180,230,30,230,45,25,20,0,20,0,0,0,0,15,10,0,0,0,30,30,0,0,0,55,25,20,0,0,15,30,20,0,0,0,0,0,40,15,10,0,0,0,0,25,30,0,0,0,0,30,0,0,null,0,0,null,0,0,null,"no"]
[127,{"$f":"Coltura!C128","v":"O14"},{"$f":"Coltura!D128","v":"Carciofo"},"nd",15.5,180,120,170,70,170,150,200,80,200,12,30,20,0,15,0,0,0,0,15,0,10,0,0,10,0,30,0,0,19,30,15,0,0,20,20,0,0,0,0,0,0,50,15,10,0,0,0,0,25,10,0,30,0,0,40,0,0,null,0,0,null,0,0,null,"no"]
[128,{"$f":"Coltura!C129","v":"O15"},{"$f":"Coltura!D129","v":"Cardo media produzione"},"nd",25.5,120,80,120,50,120,170,260,100,260,24,20,20,0,15,0,15,15,0,20,10,0,0,0,40,10,0,0,0,27,20,15,0,0,15,30,20,0,0,0,0,0,50,20,0,0,0,0,0,20,40,0,0,0,0,40,0,0,null,0,0,null,0,0,null,"no"]
[129,{"$f":"Coltura!C130","v":"O16"},{"$f":"Coltura!D130","v":"Cardo alta produzione"},"nd",32.5,150,80,120,50,120,180,270,110,270,30,20,20,0,15,0,15,15,0,20,10,0,0,0,40,10,0,0,0,35,20,15,0,0,15,30,20,0,0,0,0,0,50,20,0,0,0,0,0,40,40,0,0,0,0,40,0,0,null,0,0,null,0,0,null,"no"]
[130,{"$f":"Coltura!C131","v":"O17"},{"$f":"Coltura!D131","v":"Carota"},"nd",50,120,150,220,80,220,200,300,100,300,40,20,20,0,15,0,15,15,0,30,10,0,0,0,40,0,0,0,0,60,20,20,0,0,15,30,20,0,0,0,0,0,50,30,10,0,0,0,0,40,40,0,0,0,0,40,0,0,null,0,0,null,0,0,null,"no"]
[131,{"$f":"Coltura!C132","v":"O18"},{"$f":"Coltura!D132","v":"Cavolfiore media produzione"},"nd",35,150,80,100,30,100,150,200,30,200,28,20,20,0,20,0,0,0,0,20,10,0,0,0,30,30,0,0,0,40,20,20,0,0,15,30,20,0,0,0,0,0,40,20,10,0,0,0,0,30,30,0,0,0,0,30,0,0,null,0,0,null,0,0,null,"no"]
[{"$f":"(A134+1)","v":132},{"$f":"Coltura!C133","v":"O19"},{"$f":"Coltura!D133","v":"Cavolfiore alta produzione"},"nd",45,180,80,100,30,100,180,230,30,230,40,20,20,0,20,0,0,0,0,20,10,0,0,0,30,30,0,0,0,50,20,20,0,0,15,30,20,0,0,0,0,0,40,20,10,0,0,0,0,30,30,0,0,0,0,30,0,0,null,0,0,null,0,0,null,"no"]
[133,{"$f":"Coltura!C134","v":"O20"},{"$f":"Coltura!D134","v":"Cavolo verza mercato media produzione"},"nd",24,130,90,120,30,120,150,190,30,190,19,25,20,0,20,0,0,15,0,15,10,0,0,0,30,30,0,0,0,29,25,20,0,0,15,30,20,0,0,0,0,0,50,15,10,0,0,0,0,25,30,0,0,0,0,30,0,0,null,0,0,null,0,0,null,"no"]
[134,{"$f":"Coltura!C135","v":"O21"},{"$f":"Coltura!D135","v":"Cavolo verza mercato alta produzione"},"nd",50,160,90,120,30,120,180,220,30,220,40,25,20,0,20,0,0,15,0,15,10,0,0,0,30,30,0,0,0,60,25,20,0,0,15,30,20,0,0,0,0,0,50,15,10,0,0,0,0,25,30,0,0,0,0,30,0,0,null,0,0,null,0,0,null,"no"]
[135,{"$f":"Coltura!C136","v":"O22"},{"$f":"Coltura!D136","v":"Cavolo Riccio, Cavolo nero e Cavolo Rapa"},"nd",20,130,80,120,30,120,100,120,30,120,16,20,20,0,20,0,0,0,0,20,10,0,0,0,20,30,0,0,0,24,20,20,0,0,15,30,20,20,0,0,0,0,50,20,10,0,0,0,0,30,20,0,0,0,0,20,0,0,null,0,0,null,0,0,null,"no"]
[136,{"$f":"Coltura!C137","v":"O23"},{"$f":"Coltura!D137","v":"Cetriolo da mensa media produzione"},"nd",120,175,100,200,50,200,200,300,100,300,95,20,20,0,20,0,15,15,0,30,10,0,0,0,40,30,0,0,0,145,20,20,0,0,15,30,15,0,0,0,0,0,40,30,10,0,0,0,0,40,40,0,0,0,0,40,0,0,null,0,0,null,0,0,null,"no"]
[137,{"$f":"Coltura!C138","v":"O24"},{"$f":"Coltura!D138","v":"Cetriolo da mensa alta produzione"},"nd",150,210,100,200,50,200,250,300,150,300,140,20,20,0,20,0,15,15,0,30,10,0,0,0,40,30,0,0,0,160,20,20,0,0,15,30,15,0,0,0,0,0,40,30,10,0,0,0,0,40,40,0,0,0,0,40,0,0,null,0,0,null,0,0,null,"no"]
[138,{"$f":"Coltura!C139","v":"O25"},{"$f":"Coltura!D139","v":"Cicoria da mercato media produzione"},"nd",28,140,140,200,80,200,140,200,70,160,23,20,20,0,20,0,15,15,20,30,10,0,20,0,30,30,0,20,0,33,20,20,0,0,15,30,20,0,0,0,0,0,40,30,10,20,0,0,0,60,30,0,0,0,0,30,0,0,null,0,0,null,0,0,null,"no"]
[139,{"$f":"Coltura!C140","v":"O26"},{"$f":"Coltura!D140","v":"Cicoria da mercato alta produzione"},"nd",37.5,165,140,200,80,200,150,210,80,210,35,20,20,0,20,0,15,15,20,30,10,0,20,0,30,30,0,20,0,40,20,20,0,0,15,30,20,0,0,0,0,0,40,30,10,20,0,0,0,60,30,0,0,0,0,30,0,0,null,0,0,null,0,0,null,"no"]
[140,{"$f":"Coltura!C141","v":"O27"},{"$f":"Coltura!D141","v":"Cicoria da industria alta produzione più tagli"},"nd",28,{"$f":"IF($BR143=\"sì\",(BS143+(BU143*(Codici!$BA$2-1))))","v":170},140,200,80,200,{"$f":"IF($BR143=\"sì\",(BW143+(CA143*(Codici!$BA$2-1))))","v":140},{"$f":"IF($BR143=\"sì\",(BX143+(CB143*(Codici!$BA$2-1))))","v":200},{"$f":"IF($BR143=\"sì\",(BY143+(CC143*(Codici!$BA$2-1))))","v":70},{"$f":"IF($BR143=\"sì\",(BZ143+(CD143*(Codici!$BA$2-1))))","v":200},23,0,20,0,20,0,15,15,0,30,10,0,20,0,30,30,0,20,0,33,0,20,0,0,15,30,0,0,0,0,0,0,40,30,10,0,0,20,0,40,30,0,0,0,0,30,0,0,null,0,0,null,0,0,null,"sì",130,"comprensivo di tutti i tagli",40,"dose per tagli successivi",140,200,70,200,0,0,0,0]
[141,{"$f":"Coltura!C142","v":"O28"},{"$f":"Coltura!D142","v":"Cipolla"},"nd",45,130,85,140,50,140,150,200,70,200,36,30,20,0,15,0,15,15,0,15,0,0,0,0,25,0,0,0,0,54,30,15,0,0,15,30,0,20,0,0,0,0,50,15,10,15,0,0,0,40,25,0,0,0,0,25,0,0,null,0,0,null,0,0,null,"no"]
[142,{"$f":"Coltura!C143","v":"O29"},{"$f":"Coltura!D143","v":"Cocomero"},"nd",60,100,120,180,60,180,160,240,80,240,48,20,20,0,15,0,15,15,0,20,0,0,0,0,30,0,0,0,0,72,20,15,0,0,0,30,0,0,0,0,0,0,30,20,10,0,0,0,0,30,30,0,0,0,0,30,0,0,null,0,0,null,0,0,null,"no"]
[143,{"$f":"Coltura!C144","v":"O30"},{"$f":"Coltura!D144","v":"Endivie (indivie riccia e scarola) media produzione"},"nd",34,130,140,200,80,200,140,200,70,200,28,20,20,0,20,0,15,15,0,30,10,0,0,0,30,30,0,0,0,40,20,20,0,0,15,30,20,0,0,0,0,0,40,30,10,0,0,0,0,40,30,0,0,0,0,30,0,0,null,0,0,null,0,0,null,"no"]
[144,{"$f":"Coltura!C145","v":"O31"},{"$f":"Coltura!D145","v":"Endivie (indivie riccia e scarola) alta produzione"},"nd",45,160,140,200,80,200,160,220,90,220,40,20,20,0,20,0,15,15,20,30,10,0,20,0,30,30,0,20,0,50,20,20,0,0,15,30,20,0,0,0,0,0,40,30,10,0,0,0,0,40,30,0,0,0,0,30,0,0,null,0,0,null,0,0,null,"no"]
[145,{"$f":"Coltura!C146","v":"O32"},{"$f":"Coltura!D146","v":"Fagiolino"},"nd",9,70,70,90,50,90,70,100,40,100,7,20,10,10,20,0,15,15,0,10,10,0,0,0,20,10,0,0,0,11,20,20,10,0,15,30,0,20,0,0,0,0,25,10,10,20,0,0,0,40,20,0,0,0,0,20,0,0,null,0,0,null,0,0,null,"no"]
[146,{"$f":"Coltura!C147","v":"O33"},{"$f":"Coltura!D147","v":"Fagiolo in baccelli da sgranare"},"nd",5,70,70,90,50,90,100,130,70,100,4,10,20,0,20,0,15,15,0,10,10,0,0,0,20,30,0,0,0,6,10,20,0,0,15,30,0,20,0,0,0,0,25,10,10,10,0,0,0,30,20,0,0,0,0,20,0,0,null,0,0,null,0,0,null,"no"]
[147,{"$f":"Coltura!C148","v":"O34"},{"$f":"Coltura!D148","v":"Fagiolo secco"},"nd","nd","nd",null,null,null,null,null,null,null,null,null,null,null,null,null,null,null,null,null,null,null,null,null,null,null,null,null,null,null,"nd",null,null,null,null,null,null,null,null,null,null,null,null,null,null,null,null,null,null,null,0,null,null,null,null,null,0,0,0,null,0,0,null,0,0,null,"no"]
[148,{"$f":"Coltura!C149","v":"O35"},{"$f":"Coltura!D149","v":"Fava da consumo fresco"},"nd","nd","nd",null,null,null,null,null,null,null,null,null,null,null,null,null,null,null,null,null,null,null,null,null,null,null,null,null,null,null,"nd",null,null,null,null,null,null,null,null,null,null,null,null,null,null,null,null,null,null,null,0,null,null,null,null,null,0,0,0,null,0,0,null,0,0,null,"no"]
[149,{"$f":"Coltura!C150","v":"O36"},{"$f":"Coltura!D150","v":"Finocchio"},"nd",30,160,80,120,50,120,170,250,100,250,24,20,20,0,20,0,15,15,0,20,10,0,0,0,40,10,0,0,0,36,20,20,0,0,15,30,20,0,0,0,0,0,50,20,10,0,0,0,0,30,40,0,0,0,0,40,0,0,null,0,0,null,0,0,null,"no"]
[150,{"$f":"Coltura!C151","v":"O37"},{"$f":"Coltura!D151","v":"Fragola "},"nd",30,120,80,100,30,100,130,200,50,200,24,20,20,0,20,0,60,15,0,20,0,0,0,0,30,0,0,0,0,36,20,20,0,0,15,20,0,0,0,0,0,50,40,20,10,0,0,0,40,70,30,0,0,80,0,110,0,0,null,0,0,null,0,0,null,"no"]
[151,{"$f":"Coltura!C152","v":"O38"},{"$f":"Coltura!D152","v":"Lattuga"},"nd",32,110,70,90,50,90,150,220,80,220,26,20,20,0,20,0,15,15,20,15,10,0,20,0,30,30,0,20,0,38,20,20,0,0,15,0,20,0,0,0,0,50,40,15,10,20,0,0,0,45,30,0,0,0,0,30,0,0,null,0,0,null,0,0,null,"no"]
[152,{"$f":"Coltura!C153","v":"O39"},{"$f":"Coltura!D153","v":"Lattuga coltura protetta"},"nd","nd","nd",null,null,null,null,null,null,null,null,null,null,null,null,null,null,null,null,null,null,null,null,null,null,null,null,null,null,null,"nd",null,null,null,null,null,null,null,null,null,null,null,null,null,null,null,null,null,null,null,0,null,null,null,null,null,0,0,0,null,0,0,null,0,0,null,"no"]
[153,{"$f":"Coltura!C154","v":"O40"},{"$f":"Coltura!D154","v":"Melanzana in pieno campo media produzione"},"nd",80,250,150,210,75,210,250,300,120,300,65,45,20,0,20,0,0,15,0,30,0,0,0,0,50,0,0,0,0,95,45,20,0,0,0,0,0,0,0,0,0,0,50,30,10,0,0,0,0,40,50,0,0,0,0,50,0,0,null,0,0,null,0,0,null,"no"]
[154,{"$f":"Coltura!C155","v":"O41"},{"$f":"Coltura!D155","v":"Melanzana coltura protetta alta produzione"},"nd",150,300,200,250,125,250,300,300,120,300,140,45,20,0,20,0,0,15,0,30,0,0,0,0,50,0,0,0,0,160,45,20,0,0,0,0,0,0,0,0,0,0,50,30,10,0,0,0,0,40,50,0,0,0,0,50,0,0,null,0,0,null,0,0,null,"no"]
[155,{"$f":"Coltura!C156","v":"O42"},{"$f":"Coltura!D156","v":"Melone"},"nd",40,120,80,140,50,140,250,300,100,300,32,30,20,0,15,0,0,15,0,15,0,0,0,0,40,0,0,0,0,48,30,0,0,0,0,30,20,0,0,0,0,0,40,15,15,0,0,0,0,30,40,0,0,0,0,40,0,0,null,0,0,null,0,0,null,"no"]
[156,{"$f":"Coltura!C157","v":"O43"},{"$f":"Coltura!D157","v":"Patata"},"nd",47.5,190,110,160,60,160,270,300,170,300,40,30,20,0,20,0,80,40,0,20,0,0,0,0,50,30,0,0,0,55,30,20,0,0,15,30,20,0,0,0,0,0,40,20,20,0,0,0,0,40,50,0,0,0,40,50,0,0,null,0,0,null,0,0,null,"no"]
[157,{"$f":"Coltura!C158","v":"O44"},{"$f":"Coltura!D158","v":"Peperone in serra alta produzione"},"nd",70,190,75,150,50,150,275,300,145,300,60,35,20,0,20,0,0,0,0,20,0,0,0,0,50,0,0,0,0,80,35,20,0,0,0,0,0,0,0,0,0,0,40,20,10,0,0,0,0,30,50,0,0,0,0,50,0,0,null,0,0,null,0,0,null,"no"]
[158,{"$f":"Coltura!C159","v":"O45"},{"$f":"Coltura!D159","v":"Peperone in serra media produzione"},"nd",50,160,75,150,50,150,250,300,120,300,40,35,20,0,20,0,0,0,0,20,0,0,0,0,50,0,0,0,0,60,35,20,0,0,0,0,0,0,0,0,0,0,40,20,10,0,0,0,0,30,50,0,0,0,0,50,null,0,null,0,0,null,0,0,null,"no"]
[159,{"$f":"Coltura!C160","v":"O46"},{"$f":"Coltura!D160","v":"Piccoli frutti"},"nd","nd","nd",null,null,null,null,null,null,null,null,null,null,null,null,null,null,null,null,null,null,null,null,null,null,null,null,null,null,null,"nd",null,null,null,null,null,null,null,null,null,null,null,null,null,null,null,null,null,null,null,0,null,null,null,null,null,0,0,0,null,0,0,null,0,0,null,"no"]
[160,{"$f":"Coltura!C161","v":"O47"},{"$f":"Coltura!D161","v":"Pisello da industria (grani)"},"nd",6,50,100,130,50,130,70,90,50,90,5,20,20,10,15,0,15,15,0,10,10,0,0,0,15,30,0,0,0,7,20,20,10,0,15,30,0,20,0,0,0,0,20,20,10,20,0,0,0,50,15,0,0,0,0,15,0,0,null,0,0,null,0,0,null,"no"]
[161,{"$f":"Coltura!C162","v":"O48"},{"$f":"Coltura!D162","v":"Pisello da mercato fresco (baccelli)"},"nd",6,50,100,150,50,150,70,90,50,90,5,20,20,10,20,0,15,15,0,10,10,0,0,0,15,30,0,0,0,7,20,20,10,0,15,30,0,20,0,0,0,0,20,20,10,20,0,0,0,50,15,0,0,0,0,15,0,0,null,0,0,null,0,0,null,"no"]
[162,{"$f":"Coltura!C163","v":"O49"},{"$f":"Coltura!D163","v":"Pomodoro da industria media produzione"},"nd",70,130,130,190,80,190,200,250,120,250,60,20,20,20,20,0,60,15,0,20,10,0,0,0,40,30,0,0,0,80,20,20,20,0,15,30,20,0,0,0,0,0,40,20,10,0,0,0,0,30,40,0,0,0,0,40,0,0,null,0,0,null,0,0,null,"no"]
[163,{"$f":"Coltura!C164","v":"O50"},{"$f":"Coltura!D164","v":"Pomodoro da industria alta produzione"},"nd",90,150,150,190,100,190,230,280,150,250,80,20,20,20,20,0,60,15,0,20,10,0,0,0,40,30,0,0,0,100,20,20,20,0,15,30,20,0,0,0,0,0,40,20,10,0,0,0,0,30,40,0,0,0,0,40,0,0,null,0,0,null,0,0,null,"no"]
[164,{"$f":"Coltura!C165","v":"O51"},{"$f":"Coltura!D165","v":"Pomodoro da mensa a pieno campo"},"nd",70,130,130,190,80,190,200,250,120,250,60,20,20,20,20,0,15,15,0,30,10,0,0,0,40,30,0,0,0,80,20,15,20,0,15,30,20,0,0,0,0,0,40,30,10,0,0,0,0,40,50,0,0,0,0,50,0,0,null,0,0,null,0,0,null,"no"]
[165,{"$f":"Coltura!C166","v":"O52"},{"$f":"Coltura!D166","v":"Pomodoro da mensa in serra"},"nd",115,230,150,220,80,220,250,300,180,300,90,30,20,0,20,0,0,0,0,30,10,0,0,0,50,30,0,0,0,140,30,20,0,0,0,0,0,0,0,0,0,0,40,30,10,0,0,0,0,40,50,0,0,0,0,50,0,0,null,0,0,null,0,0,null,"no"]
[166,{"$f":"Coltura!C167","v":"O53"},{"$f":"Coltura!D167","v":"Porro"},"nd",40,"nd",null,null,null,null,null,null,null,null,null,null,null,null,null,null,null,null,null,null,null,null,null,null,null,null,null,null,null,"nd",null,null,null,null,null,null,null,null,null,null,null,null,null,null,null,null,null,null,null,0,null,null,null,null,null,0,0,0,null,0,0,null,0,0,null,"no"]
[167,{"$f":"Coltura!C168","v":"O54"},{"$f":"Coltura!D168","v":"Prezzemolo media produzione"},"nd",20,80,60,120,40,120,100,150,50,150,16,15,20,0,20,0,15,15,0,15,10,0,0,0,20,30,0,0,0,24,15,20,0,0,15,30,20,0,0,0,0,0,30,15,10,0,0,0,0,25,20,0,0,0,0,20,0,0,null,0,0,null,0,0,null,"no"]
[168,{"$f":"Coltura!C169","v":"O55"},{"$f":"Coltura!D169","v":"Prezzemolo alta produzione più tagli"},"nd",43.5,{"$f":"IF($BR171=\"sì\",(BS171+(BU171*(Codici!$BA$2-1))))","v":90},60,120,40,120,{"$f":"IF($BR171=\"sì\",(BW171+(CA171*(Codici!$BA$2-1))))","v":150},{"$f":"IF($BR171=\"sì\",(BX171+(CB171*(Codici!$BA$2-1))))","v":200},{"$f":"IF($BR171=\"sì\",(BY171+(CC171*(Codici!$BA$2-1))))","v":100},{"$f":"IF($BR171=\"sì\",(BZ171+(CD171*(Codici!$BA$2-1))))","v":200},35,0,20,0,20,0,15,15,0,15,10,0,0,0,20,30,0,0,0,52,0,20,0,0,15,30,20,0,0,0,0,0,30,15,10,0,0,0,null,25,20,0,0,0,0,20,0,0,null,0,0,null,0,0,null,"sì",70,"comprensivo di tutti i tagli",20,"dose per tagli successivi",150,200,100,200,0,0,0,0]
[169,{"$f":"Coltura!C170","v":"O56"},{"$f":"Coltura!D170","v":"Radicchio (cicoria a foglie colorate) media produzione"},"nd",20,130,120,160,80,160,140,200,70,200,16,20,20,0,20,0,15,15,0,20,10,0,0,0,30,30,0,0,0,24,20,20,0,0,15,30,20,0,0,0,0,0,30,20,10,0,0,0,0,30,30,0,0,0,0,30,0,0,null,0,0,null,0,0,null,"no"]
[170,{"$f":"Coltura!C171","v":"O57"},{"$f":"Coltura!D171","v":"Radicchio (cicoria a foglie colorate) alta produzione"},"nd",35,150,120,160,80,160,150,210,90,210,30,20,20,0,20,0,15,15,0,20,10,0,0,0,30,30,0,0,0,40,20,20,0,0,15,30,20,0,0,0,0,0,30,20,10,0,0,0,0,30,30,0,0,0,0,30,0,0,null,0,0,null,0,0,null,"no"]
[171,{"$f":"Coltura!C172","v":"O58"},{"$f":"Coltura!D172","v":"Rapa"},"nd",35,"nd",null,null,null,null,null,null,null,null,null,null,null,null,null,null,null,null,null,null,null,null,null,null,null,null,null,null,null,"nd",null,null,null,null,null,null,null,null,null,null,null,null,null,null,null,null,null,null,null,0,null,null,null,null,null,0,0,0,null,0,0,null,0,0,null,"no"]
[172,{"$f":"Coltura!C173","v":"O59"},{"$f":"Coltura!D173","v":"Ravanello"},"nd",30,80,60,100,40,100,90,120,60,120,25,20,20,0,15,0,15,15,0,10,10,0,0,0,20,30,0,0,0,35,20,20,0,0,15,30,20,0,0,0,0,0,25,10,10,20,0,0,0,40,20,0,0,0,0,20,0,0,null,0,0,null,0,0,null,"no"]
[173,{"$f":"Coltura!C174","v":"O60"},{"$f":"Coltura!D174","v":"Rucola media produzione"},"nd",18.5,110,80,120,50,120,120,160,60,120,15,30,20,0,20,0,15,15,0,15,10,0,0,0,20,10,0,0,0,22,30,20,0,0,15,20,0,0,0,0,0,0,30,15,10,0,0,0,0,25,20,0,0,0,0,20,0,0,null,0,0,null,0,0,null,"no"]
[174,{"$f":"Coltura!C175","v":"O61"},{"$f":"Coltura!D175","v":"Rucola alta produzione con più tagli"},"nd",37,{"$f":"IF($BR177=\"sì\",(BS177+(BU177*(Codici!$BA$2-1))))","v":120},80,120,50,120,{"$f":"IF($BR177=\"sì\",(BW177+(CA177*(Codici!$BA$2-1))))","v":150},{"$f":"IF($BR177=\"sì\",(BX177+(CB177*(Codici!$BA$2-1))))","v":190},{"$f":"IF($BR177=\"sì\",(BY177+(CC177*(Codici!$BA$2-1))))","v":90},{"$f":"IF($BR177=\"sì\",(BZ177+(CD177*(Codici!$BA$2-1))))","v":190},30,0,20,0,20,0,10,10,0,15,10,0,0,0,20,10,0,0,0,44,0,20,0,0,15,20,0,0,0,0,0,0,30,15,10,0,0,0,null,25,20,0,0,0,0,20,0,0,null,0,0,null,0,0,null,"sì",100,"comprensivo di tutti i tagli",20,"dose per tagli successivi",150,190,90,190,0,0,0,0]
[175,{"$f":"Coltura!C176","v":"O62"},{"$f":"Coltura!D176","v":"Scalogno"},"nd",8,90,60,90,30,90,60,80,40,80,6,20,20,0,15,0,15,15,0,15,10,0,0,0,10,30,0,0,0,10,20,15,0,0,15,30,20,20,0,0,0,0,40,15,10,0,0,0,0,25,10,0,0,0,0,10,0,0,null,0,0,null,0,0,null,"no"]
[176,{"$f":"Coltura!C177","v":"O63"},{"$f":"Coltura!D177","v":"Sedano media produzione"},"nd",50,240,120,160,80,160,150,250,100,250,40,35,20,0,20,0,15,15,0,35,10,10,0,0,20,10,0,0,0,60,35,20,0,0,15,30,20,0,0,0,0,0,50,35,10,0,0,0,0,45,20,0,0,0,0,20,0,0,null,0,0,null,0,0,null,"no"]
[177,{"$f":"Coltura!C178","v":"O64"},{"$f":"Coltura!D178","v":"Sedano alta produzione"},"nd",80,270,120,160,80,160,200,300,150,300,70,35,20,0,20,0,15,15,0,35,10,10,0,0,20,10,0,0,0,90,35,20,0,0,15,30,20,0,0,0,0,0,50,35,10,0,0,0,0,45,20,0,0,0,0,20,0,0,null,0,0,null,0,0,null,"no"]
[178,{"$f":"Coltura!C179","v":"O65"},{"$f":"Coltura!D179","v":"Spinacio alta produzione con più tagli"},"nd",27.5,{"$f":"IF($BR181=\"sì\",(BS181+(BU181*(Codici!$BA$2-1))))","v":180},50,70,30,70,{"$f":"IF($BR181=\"sì\",(BW181+(CA181*(Codici!$BA$2-1))))","v":130},{"$f":"IF($BR181=\"sì\",(BX181+(CB181*(Codici!$BA$2-1))))","v":150},{"$f":"IF($BR181=\"sì\",(BY181+(CC181*(Codici!$BA$2-1))))","v":30},{"$f":"IF($BR181=\"sì\",(BZ181+(CD181*(Codici!$BA$2-1))))","v":150},22,0,20,0,20,0,20,20,0,20,0,0,0,0,20,0,0,0,0,33,0,20,0,0,15,20,0,0,0,0,0,0,40,20,10,0,0,0,0,30,20,0,0,0,0,20,0,0,null,0,0,null,0,0,null,"sì",140,"comprensivo di tutti i tagli",40,"dose per tagli successivi",130,150,30,150,0,0,0,0]
[179,{"$f":"Coltura!C180","v":"O66"},{"$f":"Coltura!D180","v":"Spinacio media produzione"},"nd",20,150,50,70,30,70,100,120,30,120,16,20,20,0,20,0,20,20,0,20,0,0,0,0,20,0,0,0,0,24,20,20,0,0,15,20,0,0,0,0,0,0,40,20,10,0,0,0,0,30,20,0,0,0,0,20,0,0,null,0,0,null,0,0,null,"no"]
[180,{"$f":"Coltura!C181","v":"O67"},{"$f":"Coltura!D181","v":"Verza - cavolo da mercato media produzione"},"nd",24,130,90,120,30,120,150,190,30,190,19,25,20,0,20,0,0,0,0,15,10,0,0,0,30,30,0,0,0,29,25,20,0,0,15,30,20,0,0,0,0,0,50,15,10,0,0,0,0,25,30,0,0,0,0,30,0,0,null,0,0,null,0,0,null,"no"]
[181,{"$f":"Coltura!C182","v":"O68"},{"$f":"Coltura!D182","v":"Verza - cavolo da mercato alta produzione"},"nd",50,160,90,120,30,120,180,220,30,220,40,25,20,0,20,0,0,0,0,15,10,0,0,0,30,30,0,0,0,60,25,20,0,0,15,30,20,0,0,0,0,0,50,15,10,0,0,0,0,25,30,0,0,0,0,30,0,0,null,0,0,null,0,0,null,"no"]
[182,{"$f":"Coltura!C183","v":"O69"},{"$f":"Coltura!D183","v":"Verza da industria"},"nd",35,150,100,150,0,150,150,190,0,190,28,30,20,0,15,0,0,0,0,20,10,0,0,0,40,30,0,0,0,42,20,20,0,0,15,30,20,0,0,0,0,0,40,20,10,0,0,0,0,30,40,0,0,0,0,40,0,0,null,0,0,null,0,0,null,"no"]
[183,{"$f":"Coltura!C184","v":"O70"},{"$f":"Coltura!D184","v":"Zucca"},"nd",35,110,70,110,50,110,200,260,100,260,28,30,20,0,15,0,15,15,0,20,10,0,0,0,40,30,0,0,0,42,30,15,0,0,15,30,20,0,0,0,0,0,30,20,10,0,0,0,0,30,40,0,0,0,0,40,0,0,null,0,0,null,0,0,null,"no"]
[184,{"$f":"Coltura!C185","v":"O71"},{"$f":"Coltura!D185","v":"Zucchino da industria media produzione"},"nd",50,175,150,190,30,190,150,200,50,300,40,30,20,0,20,0,0,0,0,30,20,0,0,0,40,30,0,0,0,60,30,20,0,0,15,30,20,0,0,0,0,0,40,30,10,0,0,0,0,40,40,0,0,0,0,40,0,0,null,0,0,null,0,0,null,"no"]
[185,{"$f":"Coltura!C186","v":"O72"},{"$f":"Coltura!D186","v":"Zucchino da industria alta produzione"},"nd",65,200,150,190,30,190,210,260,60,260,55,30,20,0,20,0,0,0,0,30,20,0,0,0,40,30,0,0,0,75,30,20,0,0,15,30,20,0,0,0,0,0,40,30,10,0,0,0,0,40,40,0,0,0,0,40,0,0,null,0,0,null,0,0,null,"no"]
[186,{"$f":"Coltura!C187","v":"O73"},{"$f":"Coltura!D187","v":"Zucchino da mercato fresco media produzione"},"nd",40,150,100,150,30,150,150,200,50,300,32,30,20,0,20,0,20,20,0,20,20,0,0,0,40,30,0,0,0,48,30,20,0,0,15,30,20,0,0,0,0,0,40,20,10,0,0,0,0,30,40,0,0,0,0,40,0,0,null,0,0,null,0,0,null,"no"]
[187,{"$f":"Coltura!C188","v":"O74"},{"$f":"Coltura!D188","v":"Zucchino da mercato  fresco alta produzione"},"nd",50,180,100,150,30,150,210,260,60,260,40,30,20,0,20,0,20,20,0,20,20,0,0,0,40,30,0,0,0,60,30,20,0,0,15,30,20,0,0,0,0,0,40,20,10,0,0,0,0,30,40,0,0,0,0,40,0,0,null,0,0,null,0,0,null,"no"]
[188,{"$f":"Coltura!C189","v":"S1"},{"$f":"Coltura!D189","v":"Barbabiertola da seme (fase porta seme)"},"nd","nd",140,70,120,50,120,100,150,50,150,"nd",0,20,0,20,0,40,40,0,0,20,0,0,0,0,20,0,0,0,"nd",0,20,0,0,15,30,0,0,0,0,0,0,40,0,20,0,0,20,0,40,0,0,0,0,0,0,0,0,null,0,0,null,0,0,null,"no"]
[189,{"$f":"Coltura!C190","v":"S2"},{"$f":"Coltura!D190","v":"Carota da seme (fase portaseme)"},"nd","nd",120,100,150,50,150,150,200,100,200,"nd",0,20,0,15,0,15,15,0,0,10,0,0,0,0,30,0,0,0,"nd",0,20,0,0,15,30,20,0,0,0,0,0,30,0,10,20,0,0,0,30,0,0,0,0,0,0,0,0,null,0,0,null,0,0,null,"no"]
[190,{"$f":"Coltura!C191","v":"S3"},{"$f":"Coltura!D191","v":"Carota da seme (fase vivaio)"},"nd",50,120,150,220,80,220,200,300,100,300,40,20,20,0,15,0,15,15,0,30,10,0,0,0,40,30,0,0,0,60,20,20,0,0,15,30,20,0,0,0,0,0,35,30,10,0,0,0,0,40,40,0,0,0,0,40,0,0,null,0,0,null,0,0,null,"no"]
[191,{"$f":"Coltura!C192","v":"S4"},{"$f":"Coltura!D192","v":"Cavoli da seme"},"nd","nd",160,100,150,0,150,100,150,0,150,"nd",0,20,0,20,0,0,0,0,0,10,0,0,0,0,30,0,0,0,"nd",0,20,0,0,15,30,20,0,0,0,0,0,40,0,10,0,0,0,0,10,0,0,0,0,0,0,0,0,null,0,0,null,0,0,null,"no"]
[192,{"$f":"Coltura!C193","v":"S5"},{"$f":"Coltura!D193","v":"Cetriolo da seme"},"nd","nd",180,150,220,75,220,100,150,50,150,"nd",0,20,0,15,0,15,15,0,0,10,0,0,0,0,30,0,0,0,"nd",0,20,0,0,15,30,20,0,0,0,0,0,40,0,10,0,0,0,0,10,0,0,0,0,0,0,0,0,null,0,0,null,0,0,null,"no"]
[193,{"$f":"Coltura!C194","v":"S6"},{"$f":"Coltura!D194","v":"Cicoria da seme"},"nd","nd",140,120,160,60,160,120,180,60,180,"nd",0,20,0,15,0,15,15,0,0,10,0,0,0,0,30,0,0,0,"nd",0,20,0,0,15,30,20,0,0,0,0,0,40,0,10,20,0,0,0,30,0,0,0,0,0,0,0,0,null,0,0,null,0,0,null,"no"]
[194,{"$f":"Coltura!C195","v":"S7"},{"$f":"Coltura!D195","v":"Cipolla da seme (fase portaseme)"},"nd","nd",130,120,160,80,160,120,160,80,160,"nd",0,20,0,15,0,15,15,0,0,10,0,0,0,0,30,0,0,0,"nd",0,20,0,0,15,20,0,20,0,0,0,0,30,0,10,0,0,0,0,10,0,0,0,0,0,0,0,0,null,0,0,null,0,0,null,"no"]
[195,{"$f":"Coltura!C196","v":"S8"},{"$f":"Coltura!D196","v":"Cipolla da seme (fase vivaio)"},"nd",45,130,120,160,80,160,120,160,80,160,36,0,20,0,15,0,15,15,0,20,0,0,0,0,25,0,0,0,0,54,20,20,0,0,15,30,0,20,0,0,0,0,40,20,10,20,0,0,0,50,20,0,0,0,0,20,0,0,null,0,0,null,0,0,null,"no"]
[{"$f":"(A198+1)","v":196},{"$f":"Coltura!C197","v":"S9"},{"$f":"Coltura!D197","v":"Coriandolo da seme"},"nd","nd",70,70,150,40,150,50,120,0,120,"nd",0,20,0,15,0,80,15,0,0,10,0,0,0,0,10,0,0,0,"nd",0,15,0,0,15,20,20,0,0,0,0,0,20,0,10,0,0,0,0,10,0,0,0,0,0,0,0,0,null,0,0,null,0,0,null,"no"]
[197,{"$f":"Coltura!C198","v":"S10"},{"$f":"Coltura!D198","v":"Erba medica  da seme"},"nd","nd",0,60,100,30,100,150,200,0,200,"nd",0,0,0,0,0,0,0,0,0,0,0,0,0,0,0,0,0,0,"nd",0,0,0,0,0,0,0,0,0,0,100,0,100,0,0,0,0,0,0,0,0,0,0,0,0,0,0,0,null,0,0,null,0,0,null,"no"]
[198,{"$f":"Coltura!C199","v":"S11"},{"$f":"Coltura!D199","v":"Finocchio da seme"},"nd","nd",100,100,150,50,150,190,280,100,280,"nd",0,20,0,15,0,15,15,0,0,10,0,0,0,0,30,0,0,0,"nd",0,20,0,0,15,0,20,0,0,0,0,0,20,0,10,0,0,0,0,10,0,0,0,0,0,0,0,0,null,0,0,null,0,0,null,"no"]
[199,{"$f":"Coltura!C200","v":"S12"},{"$f":"Coltura!D200","v":"Frumento duro da seme (granella)"},"nd",6,160,60,80,30,80,120,150,30,150,5,25,20,0,15,0,80,40,0,15,0,0,0,0,10,0,0,0,0,7,25,15,0,0,15,30,0,0,0,0,0,0,30,15,0,0,0,0,0,15,10,0,0,0,0,10,0,0,null,0,0,null,0,0,null,"no"]
[200,{"$f":"Coltura!C201","v":"S13"},{"$f":"Coltura!D201","v":"Frumento tenero da seme (granella)"},"nd",6,140,60,80,30,80,120,150,30,150,5,30,20,0,15,0,80,40,0,15,0,0,0,0,20,0,0,0,0,7,30,15,0,0,15,30,0,0,0,0,0,0,40,15,0,0,0,0,0,15,20,0,0,0,0,20,0,0,null,0,0,null,0,0,null,"no"]
[201,{"$f":"Coltura!C202","v":"S14"},{"$f":"Coltura!D202","v":"Girasole da seme (granella)"},"nd",3,90,50,100,25,100,120,180,30,180,2.4,25,20,0,15,0,80,40,0,10,0,0,0,0,20,0,0,0,0,3.6,25,15,0,0,20,30,0,0,0,0,0,0,40,10,0,0,0,0,0,10,20,0,0,0,0,20,0,0,null,0,0,null,0,0,null,"no"]
[202,{"$f":"Coltura!C203","v":"S15"},{"$f":"Coltura!D203","v":"Lattuga da seme"},"nd","nd",100,130,210,50,210,180,260,100,260,"nd",0,20,0,15,0,15,15,0,0,10,0,0,0,0,30,0,0,0,"nd",0,20,0,0,15,30,20,0,0,0,0,0,30,0,10,20,0,0,0,30,0,0,0,0,0,0,0,0,null,0,0,null,0,0,null,"no"]
[203,{"$f":"Coltura!C204","v":"S16"},{"$f":"Coltura!D204","v":"Orzo da seme (granella)"},"nd",6.5,125,60,80,30,80,120,150,30,150,5.2,25,20,0,15,0,80,40,0,15,0,0,0,0,15,0,0,0,0,7.8,25,15,0,0,20,30,0,0,0,0,0,0,40,15,0,0,0,0,0,15,20,0,0,0,0,20,0,0,null,0,0,null,0,0,null,"no"]
[204,{"$f":"Coltura!C205","v":"S17"},{"$f":"Coltura!D205","v":"Pisello proteico da seme (granella)"},"nd","nd",50,80,110,50,110,130,190,70,190,"nd",0,20,0,15,0,15,15,0,0,15,0,0,0,0,30,0,0,0,"nd",0,20,0,0,15,30,20,0,0,0,0,0,30,0,10,20,0,0,0,30,0,0,0,0,0,0,0,0,null,0,0,null,0,0,null,"no"]
[205,{"$f":"Coltura!C206","v":"S18"},{"$f":"Coltura!D206","v":"Prezzemolo da seme"},"nd","nd",100,150,200,100,200,190,280,90,280,"nd",0,20,0,15,0,15,15,0,0,10,0,0,0,0,30,0,0,0,"nd",0,20,0,0,15,20,20,0,0,0,0,0,20,0,10,0,0,0,0,10,0,0,0,0,0,0,0,0,null,0,0,null,0,0,null,"no"]
[206,{"$f":"Coltura!C207","v":"S19"},{"$f":"Coltura!D207","v":"Ravanello da seme"},"nd","nd",150,80,120,40,120,120,180,60,180,"nd",0,20,0,15,0,15,15,0,0,10,0,0,0,0,30,0,0,0,"nd",0,20,0,0,15,30,20,0,0,0,0,0,40,0,10,20,0,0,0,30,0,0,0,0,0,0,0,0,null,0,0,null,0,0,null,"no"]
[207,{"$f":"Coltura!C208","v":"S20"},{"$f":"Coltura!D208","v":"Segale da seme (granella)"},"nd",4,100,50,100,0,100,100,150,0,150,3,30,20,0,15,15,80,40,0,12,0,0,0,0,30,0,0,0,50,5,30,15,0,0,15,30,0,0,0,0,0,0,50,12,0,0,0,0,0,12,30,0,0,0,0,30,0,0,null,0,0,null,0,0,null,"no"]
[208,{"$f":"Coltura!C209","v":"S21"},{"$f":"Coltura!D209","v":"Soia da seme (granella)"},"nd",3.5,0,50,100,30,100,80,120,30,120,"nd",0,0,0,15,0,40,40,0,0,0,0,0,10,0,0,0,0,0,"nd",0,15,0,0,20,30,120,0,0,0,0,0,120,0,0,0,0,0,0,0,0,0,0,0,0,0,0,0,null,0,0,null,0,0,null,"no"]
[209,{"$f":"Coltura!C210","v":"S22"},{"$f":"Coltura!D210","v":"Triticale da seme (granella)"},"nd",7.5,140,50,100,0,100,125,175,0,175,6.5,30,20,0,15,15,80,40,0,12,0,0,0,0,30,0,0,0,50,8.5,30,15,0,0,15,30,0,10,0,0,0,0,50,12,0,0,0,0,0,12,30,0,0,0,0,30,0,0,null,0,0,null,0,0,null,"no"]
[210,{"$f":"Coltura!C211","v":"BL1"},{"$f":"Coltura!D211","v":"Bietola da foglia"},"1° taglio",11.5,60,20,40,10,40,70,90,30,90,10,10,10,0,10,0,0,10,0,10,10,0,0,0,20,20,0,0,0,13,20,20,0,0,0,0,0,0,0,0,0,0,30,20,20,0,0,0,0,40,30,0,0,0,0,30,0,0,null,0,0,null,0,0,null,"no"]
[211,{"$f":"Coltura!C211","v":"BL1"},{"$f":"Coltura!D211","v":"Bietola da foglia"},"2° taglio o succ.",11.5,30,10,20,5,20,35,45,15,45,10,10,10,0,10,0,0,10,0,10,10,0,0,0,20,20,0,0,0,13,20,20,0,0,0,0,0,0,0,0,0,0,30,20,20,0,0,0,0,40,30,0,0,0,0,30,0,0,null,0,0,null,0,0,null,"no"]
[212,{"$f":"Coltura!C212","v":"BL2"},{"$f":"Coltura!D212","v":"Cicorino"},"1° taglio",12,60,20,40,10,40,50,90,30,90,10,10,10,0,10,0,0,10,0,10,10,0,0,0,10,20,0,0,0,14,40,20,0,0,0,0,0,0,0,0,0,0,40,20,20,0,0,0,0,40,40,0,0,0,0,40,0,0,null,0,0,null,0,0,null,"no"]
[213,{"$f":"Coltura!C212","v":"BL2"},{"$f":"Coltura!D212","v":"Cicorino"},"2° taglio o succ.",12,40,10,20,5,20,25,45,15,90,10,10,10,0,10,0,0,10,0,10,10,0,0,0,10,20,0,0,0,14,40,20,0,0,0,0,0,0,0,0,0,0,40,20,20,0,0,0,0,40,40,0,0,0,0,40,0,0,null,0,0,null,0,0,null,"no"]
[214,{"$f":"Coltura!C213","v":"BL3"},{"$f":"Coltura!D213","v":"Foglie e steli di Brassica"},"1° taglio",10,40,10,12,5,12,30,50,10,50,8,10,10,0,10,0,0,10,0,5,5,0,0,0,10,10,0,0,0,12,10,10,0,0,0,0,0,0,0,0,0,0,20,5,5,0,0,0,0,10,20,0,0,0,0,20,0,0,null,0,0,null,0,0,null,"no"]
[215,{"$f":"Coltura!C213","v":"BL3"},{"$f":"Coltura!D213","v":"Foglie e steli di Brassica"},"2° taglio o succ.",10,20,5,6,2.5,6,15,25,5,25,8,10,10,0,10,0,0,10,0,5,5,0,0,0,10,10,0,0,0,12,10,10,0,0,0,0,0,0,0,0,0,0,20,5,5,0,0,0,0,10,20,0,0,0,0,20,0,0,null,0,0,null,0,0,null,"no"]
[216,{"$f":"Coltura!C214","v":"BL4"},{"$f":"Coltura!D214","v":"Lattuga da cespo"},"un ciclo intero",32,110,70,90,50,90,150,220,80,220,26,20,20,0,15,0,15,15,20,15,10,0,20,0,30,30,0,20,0,38,20,20,0,0,15,30,20,0,0,0,0,0,30,15,10,20,0,0,0,45,30,0,0,0,0,30,0,0,null,0,0,null,0,0,null,"no"]
[217,{"$f":"Coltura!C215","v":"BL5"},{"$f":"Coltura!D215","v":"Lattughino 1° taglio"},"1° taglio",11.5,25,5,10,0,10,20,45,10,45,9,10,10,0,10,0,20,20,0,5,5,0,0,0,10,10,0,0,0,14,10,10,0,0,0,0,0,0,0,0,0,0,20,5,5,0,0,0,0,10,20,0,0,0,0,20,0,0,null,0,0,null,0,0,null,"no"]
[218,{"$f":"Coltura!C216","v":"BL6"},{"$f":"Coltura!D216","v":"Lattughino 2° taglio"},"2° taglio o succ.",11.5,15,2.5,5,0,5,10,22.5,5,22.5,9,10,10,0,10,0,20,20,0,5,5,0,0,0,10,10,0,0,0,14,10,10,0,0,0,0,0,0,0,0,0,0,20,5,5,0,0,0,0,10,20,0,0,0,0,20,0,0,null,0,0,null,0,0,null,"no"]
[219,{"$f":"Coltura!C217","v":"BL7"},{"$f":"Coltura!D217","v":"Rucola 1° taglio"},"1° taglio",8.5,40,10,12,5,12,30,50,10,50,5,10,10,0,10,0,10,10,0,5,5,0,0,0,10,10,0,0,0,10,10,10,0,0,0,0,0,0,0,0,0,0,20,5,5,0,0,0,0,10,20,0,0,0,0,20,0,0,null,0,0,null,0,0,null,"no"]
[220,{"$f":"Coltura!C218","v":"BL8"},{"$f":"Coltura!D218","v":"Rucola 2° taglio"},"2° taglio o succ.",8.5,15,5,6,2.5,6,15,25,5,25,5,10,10,0,10,0,10,10,0,5,5,0,0,0,10,10,0,0,0,10,10,10,0,0,0,0,0,0,0,0,0,0,20,5,5,0,0,0,0,10,20,0,0,0,0,20,0,0,null,0,0,null,0,0,null,"no"]
[221,{"$f":"Coltura!C219","v":"BL9"},{"$f":"Coltura!D219","v":"Spinacino 1° taglio"},"1° taglio",6,25,10,15,5,15,40,65,20,65,4,10,10,0,10,0,10,10,0,5,5,0,0,0,10,10,0,0,0,8,10,10,0,0,0,0,0,0,0,0,0,0,20,5,5,0,0,0,0,10,20,0,0,0,0,20,0,0,null,0,0,null,0,0,null,"no"]
[222,{"$f":"Coltura!C220","v":"BL10"},{"$f":"Coltura!D220","v":"Spinacino 2° taglio"},"2° taglio o succ.",6,15,5,7.5,2.5,7.5,20,32.5,10,32.5,4,10,10,0,10,0,10,10,0,5,5,0,0,0,10,10,0,0,0,8,10,10,0,0,0,0,0,0,0,0,0,0,20,5,5,0,0,0,0,10,20,0,0,0,0,20,0,0,null,0,0,null,0,0,null,"no"]
[223,{"$f":"Coltura!C221","v":"BL11"},{"$f":"Coltura!D221","v":"Valerianella"},"un ciclo intero",9,40,10,15,5,15,30,50,10,50,8,10,10,0,10,0,0,0,0,5,5,0,0,0,10,10,0,0,0,10,20,20,0,0,0,0,0,0,0,0,0,0,20,5,5,0,0,0,0,10,20,0,0,0,0,20,0,0,null,0,0,null,0,0,null,"no"]
[224,{"$f":"Coltura!C222","v":"BL12"},{"$f":"Coltura!D222","v":"baby leaf generica"},"un ciclo intero",10,40,10,12,5,12,30,50,10,50,8,10,10,0,10,0,0,10,0,5,5,0,0,0,10,10,0,0,0,12,10,10,0,0,0,0,0,0,0,0,0,0,20,5,5,0,0,0,0,10,20,0,0,0,0,20,0,0,null,0,0,null,0,0,null,"no"]
[225,{"$f":"Coltura!C223","v":0},{"$f":"Coltura!D223","v":0},null,null,null,null,null,null,null,null,null,null,null,null,null,null,null,null,null,null,null,null,null,null,null,null,null,null,null,null,null,null,null,null,null,null,null,null,null,null,null,null,null,null,null,null,null,null,null,null,null,null,null,null,null,null,null,null,null,null,null,null,null,null,null,null,null,null,"no"]
[null,null,null,null,null,null,null,null,null,null,null,null,null,null,null,null,null,null,null,null,null,null,null,null,null,null,null,null,null,null,null,null,null,null,null,null,null,null,null,null,null,null,null,null,null,null,null,null,null,null,null,null,null,null,null,null,null,null,null,null,null,null,null,null,null,null,null,null,null,"no"]
[1,2,3,4,{"$f":"(D230+1)","v":5},{"$f":"(E230+1)","v":6},7,8,9,10,11,12,13,14,15,16,17,18,19,20,21,22,23,24,25,26,27,28,29,30,31,32,33,34,35,36,37,38,39,40,41,42,43,44,45,46,47,48,49,50,51,52,53,54,55,56,57,58,{"$f":"(BF230+1)","v":59},{"$f":"(BG230+1)","v":60},{"$f":"(BH230+1)","v":61},{"$f":"(BI230+1)","v":62},{"$f":"(BJ230+1)","v":63},{"$f":"(BK230+1)","v":64},{"$f":"(BL230+1)","v":65},{"$f":"(BM230+1)","v":66},{"$f":"(BN230+1)","v":67},{"$f":"(BO230+1)","v":68},{"$f":"(BP230+1)","v":69},{"$f":"(BQ230+1)","v":70},{"$f":"(BR230+1)","v":71},{"$f":"(BS230+1)","v":72},{"$f":"(BT230+1)","v":73},{"$f":"(BU230+1)","v":74},{"$f":"(BV230+1)","v":75},{"$f":"(BW230+1)","v":76},{"$f":"(BX230+1)","v":77},{"$f":"(BY230+1)","v":78},{"$f":"(BZ230+1)","v":79},{"$f":"(CA230+1)","v":80},{"$f":"(CB230+1)","v":81},{"$f":"(CC230+1)","v":82}]
[null,"criterio"]
["ordinato","ID_Coltura","coltura","fase"]
[{"$f":"DGET($A$3:$BF$227,A230,$B232:$D233)","v":207},{"$f":"Coltura!C225","v":"S20"},{"$f":"Coltura!D225","v":"Segale da seme (granella)"},{"$f":"IF(Gruppo!A9=6,Cicli_Fase!F31,\"nd\")","v":"nd"},{"$f":"DGET($A$3:$BF$227,E230,$B232:$D233)","v":4},100,50,100,0,100,100,150,0,150,3,30,20,0,15,15,80,40,0,12,0,0,0,0,30,0,0,0,50,5,30,15,{"$f":"DGET($A$3:$BF$227,AK230,$B232:$D233)","v":0},0,15,30,0,0,0,0,0,0,50,12,0,0,0,0,0,12,30,0,0,{"$f":"DGET($A$3:BF$227,BF230,$B232:$D233)","v":0},{"$f":"DGET($A$3:BG$227,BG230,$B232:$D233)","v":0},{"$f":"DGET($A$3:BH$227,BH230,$B232:$D233)","v":30},{"$f":"DGET($A$3:BI$227,BI230,$B232:$D233)","v":0},{"$f":"DGET($A$3:BJ$227,BJ230,$B232:$D233)","v":0},{"$f":"DGET($A$3:BK$227,BK230,$B232:$D233)","v":{"$error":"#VALUE!"}},{"$f":"DGET($A$3:BL$227,BL230,$B232:$D233)","v":0},{"$f":"DGET($A$3:BM227,BM230,$B232:$D233)","v":0},{"$f":"DGET($A$3:BN227,BN230,$B232:$D233)","v":{"$error":"#VALUE!"}},{"$f":"DGET($A$3:BO227,BO230,$B232:$D233)","v":0},{"$f":"DGET($A$3:BP227,BP230,$B232:$D233)","v":0},{"$f":"DGET($A$3:BQ227,BQ230,$B232:$D233)","v":{"$error":"#VALUE!"}},{"$f":"DGET($A$3:BV227,BR230,$B232:$D233)","v":"no"},{"$f":"DGET($A$3:BS227,BS230,$B232:$D233)","v":{"$error":"#VALUE!"}},{"$f":"DGET($A$3:BT227,BT230,$B232:$D233)","v":{"$error":"#VALUE!"}},{"$f":"DGET($A$3:BU227,BU230,$B232:$D233)","v":{"$error":"#VALUE!"}},{"$f":"DGET($A$3:BV227,BV230,$B232:$D233)","v":{"$error":"#VALUE!"}},{"$f":"DGET($A$3:BW227,BW230,$B232:$D233)","v":{"$error":"#VALUE!"}},{"$f":"DGET($A$3:BX227,BX230,$B232:$D233)","v":{"$error":"#VALUE!"}},{"$f":"DGET($A$3:BY227,BY230,$B232:$D233)","v":{"$error":"#VALUE!"}},{"$f":"DGET($A$3:BZ227,BZ230,$B232:$D233)","v":{"$error":"#VALUE!"}},{"$f":"DGET($A$3:CA227,CA230,$B232:$D233)","v":{"$error":"#VALUE!"}},{"$f":"DGET($A$3:CB227,CB230,$B232:$D233)","v":{"$error":"#VALUE!"}},{"$f":"DGET($A$3:CC227,CC230,$B232:$D233)","v":{"$error":"#VALUE!"}},{"$f":"DGET($A$3:CD227,CD230,$B232:$D233)","v":{"$error":"#VALUE!"}}]
[]
[null,null,"errore",null,{"$f":"ISERROR(E233)","v":false}]
[null,null,"ID_Fa_D",null,"Corretta"]
[null,null,{"$f":"Cicli_Fase!F31","v":"Autunno-vernina <150 gg"},null,{"$f":"IF(E235=TRUE,\"ND\",IF(OR(Cicli_Fase!$F$30=1,Cicli_Fase!$F$30=2,Cicli_Fase!F30=15),0,IF(Cicli_Fase!$F$30=3,Standard!$E$233/3,IF(Cicli_Fase!F30=16,Standard!E233*0.66,Standard!E233))))","v":4},null,null,null,null,null,null,null,null,null,null,null,null,null,null,null,null,null,null,null,null,null,null,null,null,null,null,null,null,{"$f":"IF(AH235=TRUE,\"ND\",IF(OR(Cicli_Fase!$F$30=1,Cicli_Fase!$F$30=2),0,IF(Cicli_Fase!$F$30=3,Standard!$E$233/3,Standard!AH233)))","v":5},null,null,null,null,null,null,null,null,null,null,null,null,null,null,null,null,null,null,null,null,null,null,null,null,null,null,null,{"$f":"IF(Inserimento!$T$10>Inserimento!$V$10,Standard!BJ233+Standard!BK233,Standard!BJ233)","v":0},null,null,{"$f":"IF(Inserimento!$T$10>Inserimento!$V$10,Standard!BM233+Standard!BN233,Standard!BM233)","v":0},null,null,{"$f":"IF(Inserimento!$T$10>Inserimento!$V$10,Standard!BP233+Standard!BQ233,Standard!BP233)","v":0}]

{"sheet":"MAS","index":6,"n_rows":248,"n_cols":20,"rows_kept":248,"cut":false,"hidden":true,"merged":[[243,13,243,17],[238,13,238,17],[240,13,240,17],[241,13,241,17],[242,13,242,17],[239,13,239,17]]}
[null,null,"CONTROLLO DEL MAS",null,null,null,"Da Tab. MAS",null,null,null,null,null,null,"Uniformato a DPI"]
[null,null,null,null,null,"Teorico massimo o con assenza inoculo","MAS","resa","come","prod.","asciutto / irriguo","resa","ss","Resa_Standard","N_Standard","Incremento max","Dose max"]
["ordinato","progressivo di gruppo","ID_Coltura","fase","Coltura","kg/ha","kg/ha","t","come","prod.","sì/no","t/ha","%",null,null,null,"kg/ha","nota"]
[{"$f":"Coltura!A2","v":1},{"$f":"Coltura!B2","v":1},{"$f":"Coltura!C2","v":"A2"},"nd",{"$f":"Coltura!D2","v":"Actinidia polpa verde frutti, legno e foglie"},340,150,25,"tq",null,"no",{"$f":"IF(I4=\"tq\",H4,IF(I4=\"s.s.\",(H4/(M4/100))))","v":25},null,{"$f":"Standard!E4","v":25},{"$f":"Standard!F4","v":120},{"$f":"Standard!AU4","v":40},{"$f":"(O4+P4)","v":160},"RR n.3 2017"]
[{"$f":"Coltura!A3","v":2},{"$f":"Coltura!B3","v":2},{"$f":"Coltura!C3","v":"Ab2"},"nd",{"$f":"Coltura!D3","v":"Actinidia polpa gialla frutti, legno e foglie"},340,150,25,"tq",null,"no",{"$f":"IF(I5=\"tq\",H5,IF(I5=\"s.s.\",(H5/(M5/100))))","v":25},null,{"$f":"Standard!E5","v":30},{"$f":"Standard!F5","v":150},{"$f":"Standard!AU5","v":40},{"$f":"(O5+P5)","v":190},"RR n.3 2018"]
[{"$f":"Coltura!A4","v":3},{"$f":"Coltura!B4","v":3},{"$f":"Coltura!C4","v":"A4"},"nd",{"$f":"Coltura!D4","v":"Albicocco media produzione frutti, legno e foglie"},340,135,13,"tq",null,"no",{"$f":"IF(I6=\"tq\",H6,IF(I6=\"s.s.\",(H6/(M6/100))))","v":13},null,{"$f":"Standard!E6","v":13},{"$f":"Standard!F6","v":75},{"$f":"Standard!AU6","v":50},{"$f":"(O6+P6)","v":125},"RR n.3 2017"]
[{"$f":"Coltura!A5","v":4},{"$f":"Coltura!B5","v":4},{"$f":"Coltura!C5","v":"A5"},"nd",{"$f":"Coltura!D5","v":"Albicocco  alta produzione frutti, legno e foglie"},340,135,13,"tq",null,"no",13,null,{"$f":"Standard!E7","v":18},{"$f":"Standard!F7","v":100},{"$f":"Standard!AU7","v":50},150,"RR n.3 2018"]
[{"$f":"Coltura!A6","v":5},{"$f":"Coltura!B6","v":5},{"$f":"Coltura!C6","v":"A6"},"nd",{"$f":"Coltura!D6","v":"Altri fruttiferi frutti, legno e foglie"},340,"nd","nd","nd","nd","no",false,null,{"$f":"Standard!E8","v":"nd"},{"$f":"Standard!F8","v":"nd"},{"$f":"Standard!AU8","v":0},{"$error":"#VALUE!"}]
[{"$f":"Coltura!A7","v":6},{"$f":"Coltura!B7","v":6},{"$f":"Coltura!C7","v":"A8"},"nd",{"$f":"Coltura!D7","v":"Arancio frutti, legno e foglie"},340,"nd","nd","nd","nd","no",false,null,{"$f":"Standard!E9","v":30},{"$f":"Standard!F9","v":120},{"$f":"Standard!AU9","v":50},170,"RR n.3 2017"]
[{"$f":"Coltura!A8","v":7},{"$f":"Coltura!B8","v":7},{"$f":"Coltura!C8","v":"A10"},"nd",{"$f":"Coltura!D8","v":"Castagno solo frutti"},340,"nd","nd","nd","nd","no",false,null,{"$f":"Standard!E10","v":"nd"},{"$f":"Standard!F10","v":"nd"},{"$f":"Standard!AU10","v":0},{"$error":"#VALUE!"}]
[{"$f":"Coltura!A9","v":8},{"$f":"Coltura!B9","v":8},{"$f":"Coltura!C9","v":"A12"},"nd",{"$f":"Coltura!D9","v":"Ciliegio frutti, legno e foglie"},340,120,9,"tq",null,"no",9,null,{"$f":"Standard!E11","v":9},{"$f":"Standard!F11","v":70},{"$f":"Standard!AU11","v":50},120,"RR n.3 2017"]
[{"$f":"Coltura!A10","v":9},{"$f":"Coltura!B10","v":9},{"$f":"Coltura!C10","v":"A14"},"nd",{"$f":"Coltura!D10","v":"Clementine frutti, legno e foglie"},340,"nd","nd","nd","nd","no",false,null,{"$f":"Standard!E12","v":25},{"$f":"Standard!F12","v":140},{"$f":"Standard!AU12","v":50},190,"RR n.3 2017"]
[{"$f":"Coltura!A11","v":10},{"$f":"Coltura!B11","v":10},{"$f":"Coltura!C11","v":"A16"},"nd",{"$f":"Coltura!D11","v":"Fico frutti, legno e foglie"},340,"nd","nd","nd","nd","no",false,null,{"$f":"Standard!E13","v":"nd"},{"$f":"Standard!F13","v":"nd"},{"$f":"Standard!AU13","v":0},{"$error":"#VALUE!"}]
[{"$f":"Coltura!A12","v":11},{"$f":"Coltura!B12","v":11},{"$f":"Coltura!C12","v":"A18"},"nd",{"$f":"Coltura!D12","v":"Kaki frutti, legno e foglie"},340,"nd","nd","nd","nd","no",false,null,{"$f":"Standard!E14","v":25},{"$f":"Standard!F14","v":60},{"$f":"Standard!AU14","v":40},100,"RR n.3 2017"]
[{"$f":"Coltura!A13","v":12},{"$f":"Coltura!B13","v":12},{"$f":"Coltura!C13","v":"A20"},"nd",{"$f":"Coltura!D13","v":"Limone frutti, legno e foglie"},340,"nd","nd","nd","nd","no",false,null,{"$f":"Standard!E15","v":30},{"$f":"Standard!F15","v":120},{"$f":"Standard!AU15","v":50},170,"RR n.3 2017"]
[{"$f":"Coltura!A14","v":13},{"$f":"Coltura!B14","v":13},{"$f":"Coltura!C14","v":"A22"},"nd",{"$f":"Coltura!D14","v":"Mandarino frutti, legno e foglie"},340,"nd","nd","nd","nd","no",false,null,{"$f":"Standard!E16","v":25},{"$f":"Standard!F16","v":140},{"$f":"Standard!AU16","v":50},190,"RR n.3 2017"]
[{"$f":"Coltura!A15","v":14},{"$f":"Coltura!B15","v":14},{"$f":"Coltura!C15","v":"A24"},"nd",{"$f":"Coltura!D15","v":"Mandorlo frutti, legno e foglie"},340,"nd","nd","nd","nd","no",false,null,{"$f":"Standard!E17","v":"nd"},{"$f":"Standard!F17","v":"nd"},{"$f":"Standard!AU17","v":0},{"$error":"#VALUE!"}]
[{"$f":"Coltura!A16","v":15},{"$f":"Coltura!B16","v":15},{"$f":"Coltura!C16","v":"A26"},"nd",{"$f":"Coltura!D16","v":"Melo frutti, legno e foglie"},340,120,35,"tq",null,"no",35,null,{"$f":"Standard!E18","v":40},{"$f":"Standard!F18","v":80},{"$f":"Standard!AU18","v":60},140,"RR n.3 2017"]
[{"$f":"Coltura!A17","v":16},{"$f":"Coltura!B17","v":16},{"$f":"Coltura!C17","v":"A28"},"nd",{"$f":"Coltura!D17","v":"Nashi frutti, legno e foglie"},340,"nd","nd","nd","nd","no",false,null,{"$f":"Standard!E19","v":"nd"},{"$f":"Standard!F19","v":"nd"},{"$f":"Standard!AU19","v":0},{"$error":"#VALUE!"}]
[{"$f":"Coltura!A18","v":17},{"$f":"Coltura!B18","v":17},{"$f":"Coltura!C18","v":"A30"},"nd",{"$f":"Coltura!D18","v":"Nespolo frutti, legno e foglie"},340,"nd","nd","nd","nd","no",false,null,{"$f":"Standard!E20","v":"nd"},{"$f":"Standard!F20","v":"nd"},{"$f":"Standard!AU20","v":0},{"$error":"#VALUE!"}]
[{"$f":"Coltura!A19","v":18},{"$f":"Coltura!B19","v":18},{"$f":"Coltura!C19","v":"A32"},"nd",{"$f":"Coltura!D19","v":"Nettarine frutti, legno e foglie"},340,175,25,"tq",null,"no",25,null,{"$f":"Standard!E21","v":25},{"$f":"Standard!F21","v":100},{"$f":"Standard!AU21","v":50},150,"RR n.3 2017"]
[{"$f":"Coltura!A20","v":19},{"$f":"Coltura!B20","v":19},{"$f":"Coltura!C20","v":"A34"},"nd",{"$f":"Coltura!D20","v":"Nocciolo frutti, legno e foglie"},340,100,2,"tq",null,"no",2,null,{"$f":"Standard!E22","v":"nd"},{"$f":"Standard!F22","v":"nd"},{"$f":"Standard!AU22","v":0},{"$error":"#VALUE!"}]
[{"$f":"Coltura!A21","v":20},{"$f":"Coltura!B21","v":20},{"$f":"Coltura!C21","v":"A36"},"nd",{"$f":"Coltura!D21","v":"Noce da frutto frutti, legno e foglie"},340,120,4,"tq",null,"no",4,null,{"$f":"Standard!E23","v":4},{"$f":"Standard!F23","v":90},{"$f":"Standard!AU23","v":50},140,"RR n.3 2017"]
[{"$f":"Coltura!A22","v":21},{"$f":"Coltura!B22","v":21},{"$f":"Coltura!C22","v":"A38"},"nd",{"$f":"Coltura!D22","v":"Olivo olive, legno e foglie"},340,"nd","nd","nd","nd","no",false,null,{"$f":"Standard!E24","v":4},{"$f":"Standard!F24","v":70},{"$f":"Standard!AU24","v":30},100,"RR n.3 2017"]
[{"$f":"Coltura!A23","v":22},{"$f":"Coltura!B23","v":22},{"$f":"Coltura!C23","v":"A40"},"nd",{"$f":"Coltura!D23","v":"Pero media produzione frutti, legno e foglie"},340,120,30,"tq",null,"no",30,null,{"$f":"Standard!E25","v":30},{"$f":"Standard!F25","v":90},{"$f":"Standard!AU25","v":50},140,"RR n.3 2017"]
[{"$f":"Coltura!A24","v":23},{"$f":"Coltura!B24","v":23},{"$f":"Coltura!C24","v":"A41"},"nd",{"$f":"Coltura!D24","v":"Pero alta produzione frutti, legno e foglie"},340,120,30,"tq",null,"no",{"$f":"IF(I26=\"tq\",H26,IF(I26=\"s.s.\",(H26/(M26/100))))","v":30},null,{"$f":"Standard!E26","v":40},{"$f":"Standard!F26","v":120},{"$f":"Standard!AU26","v":50},{"$f":"(O26+P26)","v":170},"RR n.3 2018"]
[{"$f":"Coltura!A25","v":24},{"$f":"Coltura!B25","v":24},{"$f":"Coltura!C25","v":"A42"},"nd",{"$f":"Coltura!D25","v":"Pesco frutti, legno e foglie"},340,175,25,"tq",null,"no",25,null,{"$f":"Standard!E27","v":25},{"$f":"Standard!F27","v":100},{"$f":"Standard!AU27","v":50},150,"RR n.3 2017"]
[{"$f":"Coltura!A26","v":25},{"$f":"Coltura!B26","v":25},{"$f":"Coltura!C26","v":"A43"},"nd",{"$f":"Coltura!D26","v":"Pioppo"},340,"nd","nd","nd","nd","no",false,null,{"$f":"Standard!E28","v":"nd"},{"$f":"Standard!F28","v":"nd"},{"$f":"Standard!AU28","v":0},{"$error":"#VALUE!"}]
[{"$f":"Coltura!A27","v":26},{"$f":"Coltura!B27","v":26},{"$f":"Coltura!C27","v":"A44"},"nd",{"$f":"Coltura!D27","v":"Pioppo da energia"},340,"nd","nd","nd","nd","no",false,null,{"$f":"Standard!E29","v":"nd"},{"$f":"Standard!F29","v":"nd"},{"$f":"Standard!AU29","v":0},{"$error":"#VALUE!"}]
[{"$f":"Coltura!A28","v":27},{"$f":"Coltura!B28","v":27},{"$f":"Coltura!C28","v":"A46"},"nd",{"$f":"Coltura!D28","v":"Susino frutti, legno e foglie"},340,120,20,"tq",null,"no",20,null,{"$f":"Standard!E30","v":25},{"$f":"Standard!F30","v":90},{"$f":"Standard!AU30","v":50},140,"RR n.3 2017"]
[{"$f":"Coltura!A29","v":28},{"$f":"Coltura!B29","v":28},{"$f":"Coltura!C29","v":"A48"},"nd",{"$f":"Coltura!D29","v":"Uva da tavola grappoli, tralci e foglie"},340,100,18,"tq",null,"no",18,null,{"$f":"Standard!E31","v":25},{"$f":"Standard!F31","v":90},{"$f":"Standard!AU31","v":50},140,"RR n.3 2017"]
[{"$f":"Coltura!A30","v":29},{"$f":"Coltura!B30","v":29},{"$f":"Coltura!C30","v":"A50"},"nd",{"$f":"Coltura!D30","v":"Vite per uva da vino (collina e montagna) grappoli, tralci e foglie "},340,70,9,"tq",null,"no",9,null,{"$f":"Standard!E32","v":10},{"$f":"Standard!F32","v":50},{"$f":"Standard!AU32","v":40},90,"RR n.3 2017"]
[{"$f":"Coltura!A31","v":30},{"$f":"Coltura!B31","v":30},{"$f":"Coltura!C31","v":"A52"},"nd",{"$f":"Coltura!D31","v":"Vite per uva da vino (pianura) grappoli, legno e foglie"},340,100,18,"tq",null,"no",18,null,{"$f":"Standard!E33","v":20},{"$f":"Standard!F33","v":80},{"$f":"Standard!AU33","v":30},110,"RR n.3 2017"]
[{"$f":"Coltura!A32","v":31},{"$f":"Coltura!B32","v":1},{"$f":"Coltura!C32","v":"E1"},"nd",{"$f":"Coltura!D32","v":"Altri cereali a paglia (pianta intera)"},340,"nd","nd","nd","nd","no",false,null,{"$f":"Standard!E34","v":"nd"},{"$f":"Standard!F34","v":"nd"},{"$f":"Standard!AU34","v":0},{"$error":"#VALUE!"}]
[{"$f":"Coltura!A33","v":32},{"$f":"Coltura!B33","v":2},{"$f":"Coltura!C33","v":"E2"},"nd",{"$f":"Coltura!D33","v":"Avena"},340,110,4.5,"tq","gran","no",4.5,87,{"$f":"Standard!E35","v":3.2},{"$f":"Standard!F35","v":60},{"$f":"Standard!AU35","v":40},100,"RR n.3 2017"]
[{"$f":"Coltura!A34","v":33},{"$f":"Coltura!B34","v":3},{"$f":"Coltura!C34","v":"E3"},"nd",{"$f":"Coltura!D34","v":"Avena pianta intera"},340,110,4.5,"tq","gran","no",4.5,87,{"$f":"Standard!E36","v":3.2},{"$f":"Standard!F36","v":60},{"$f":"Standard!AU36","v":40},100,"RR n.3 2017"]
[{"$f":"Coltura!A35","v":34},{"$f":"Coltura!B35","v":4},{"$f":"Coltura!C35","v":"E4"},"nd",{"$f":"Coltura!D35","v":"Barbababietola da zucchero (pianta intera)"},340,160,60,"tq",null,"no",60,23,{"$f":"Standard!E37","v":50},{"$f":"Standard!F37","v":120},{"$f":"Standard!AU37","v":40},160,"RR n.3 2017"]
[{"$f":"Coltura!A36","v":35},{"$f":"Coltura!B36","v":5},{"$f":"Coltura!C36","v":"E5"},"nd",{"$f":"Coltura!D36","v":"Barbabietola da zucchero  (radici)"},340,160,60,"tq",null,"no",60,23,{"$f":"Standard!E38","v":50},{"$f":"Standard!F38","v":120},{"$f":"Standard!AU38","v":40},160,"RR n.3 2017"]
[{"$f":"Coltura!A37","v":36},{"$f":"Coltura!B37","v":6},{"$f":"Coltura!C37","v":"E6"},"nd",{"$f":"Coltura!D37","v":"Canapa da fibra"},340,"nd","nd","nd","nd","no",false,30,{"$f":"Standard!E39","v":"nd"},{"$f":"Standard!F39","v":"nd"},{"$f":"Standard!AU39","v":0},{"$error":"#VALUE!"}]
[{"$f":"Coltura!A38","v":37},{"$f":"Coltura!B38","v":7},{"$f":"Coltura!C38","v":"E7"},"nd",{"$f":"Coltura!D38","v":"Cavolo abissino"},340,"nd","nd","nd","nd","no",false,90,{"$f":"Standard!E40","v":"nd"},{"$f":"Standard!F40","v":"nd"},{"$f":"Standard!AU40","v":0},{"$error":"#VALUE!"}]
[{"$f":"Coltura!A39","v":38},{"$f":"Coltura!B39","v":8},{"$f":"Coltura!C39","v":"E8"},"nd",{"$f":"Coltura!D39","v":"Cece"},340,80,3,"tq",null,"no",3,86,{"$f":"Standard!E41","v":2},{"$f":"Standard!F41","v":40},{"$f":"Standard!AU41","v":30},70,"RR n.3 2017"]
[{"$f":"Coltura!A40","v":39},{"$f":"Coltura!B40","v":9},{"$f":"Coltura!C40","v":"E9"},"nd",{"$f":"Coltura!D40","v":"Colza"},340,150,4,"tq","gran","no",4,90,{"$f":"Standard!E42","v":2.5},{"$f":"Standard!F42","v":135},{"$f":"Standard!AU42","v":40},175,"RR n.3 2017"]
[{"$f":"Coltura!A41","v":40},{"$f":"Coltura!B41","v":10},{"$f":"Coltura!C41","v":"E10"},"nd",{"$f":"Coltura!D41","v":"Colza pianta intera"},340,150,4,"tq","gran","no",4,90,{"$f":"Standard!E43","v":2.5},{"$f":"Standard!F43","v":135},{"$f":"Standard!AU43","v":40},175,"RR n.3 2017"]
[{"$f":"Coltura!A42","v":41},{"$f":"Coltura!B42","v":11},{"$f":"Coltura!C42","v":"E11"},"nd",{"$f":"Coltura!D42","v":"Farro"},340,"nd","nd","nd","nd","no",false,87,{"$f":"Standard!E44","v":2},{"$f":"Standard!F44","v":40},{"$f":"Standard!AU44","v":30},70,"RR n.3 2017"]
[{"$f":"Coltura!A43","v":42},{"$f":"Coltura!B43","v":12},{"$f":"Coltura!C43","v":"E12"},"nd",{"$f":"Coltura!D43","v":"Farro (pianta intera)"},340,"nd","nd","nd","nd","no",false,87,{"$f":"Standard!E45","v":2},{"$f":"Standard!F45","v":40},{"$f":"Standard!AU45","v":30},70,"RR n.3 2017"]
[{"$f":"Coltura!A44","v":43},{"$f":"Coltura!B44","v":13},{"$f":"Coltura!C44","v":"E13"},"nd",{"$f":"Coltura!D44","v":"Favino da granella"},340,"nd","nd","nd","nd","no",false,86,{"$f":"Standard!E46","v":2},{"$f":"Standard!F46","v":0},{"$f":"Standard!AU46","v":40},40,"RR n.3 2017"]
[{"$f":"Coltura!A45","v":44},{"$f":"Coltura!B45","v":14},{"$f":"Coltura!C45","v":"E14"},"nd",{"$f":"Coltura!D45","v":"Girasole (acheni)"},340,120,3.5,"tq","gran","no",3.5,90,{"$f":"Standard!E47","v":3},{"$f":"Standard!F47","v":90},{"$f":"Standard!AU47","v":40},130,"RR n.3 2017"]
[{"$f":"Coltura!A46","v":45},{"$f":"Coltura!B46","v":15},{"$f":"Coltura!C46","v":"E15"},"nd",{"$f":"Coltura!D46","v":"Girasole (pianta intera)"},340,120,3.5,"tq","gran","no",3.5,90,{"$f":"Standard!E48","v":3},{"$f":"Standard!F48","v":90},{"$f":"Standard!AU48","v":40},130,"RR n.3 2017"]
[{"$f":"Coltura!A47","v":46},{"$f":"Coltura!B47","v":16},{"$f":"Coltura!C47","v":"E16"},"nd",{"$f":"Coltura!D47","v":"Grano duro (granella)"},340,190,6,"tq","gran","no",6,87,{"$f":"Standard!E49","v":6},{"$f":"Standard!F49","v":160},{"$f":"Standard!AU49","v":40},200,"RR n.3 2017"]
[{"$f":"Coltura!A48","v":47},{"$f":"Coltura!B48","v":17},{"$f":"Coltura!C48","v":"E17"},"nd",{"$f":"Coltura!D48","v":"Grano duro (pianta intera)"},340,190,6,"tq","gran","no",6,87,{"$f":"Standard!E50","v":6},{"$f":"Standard!F50","v":160},{"$f":"Standard!AU50","v":40},200,"RR n.3 2017"]
[{"$f":"Coltura!A49","v":48},{"$f":"Coltura!B49","v":18},{"$f":"Coltura!C49","v":"E18"},"nd",{"$f":"Coltura!D49","v":"Grano tenero FP/FPS (granella)"},340,180,6.5,"tq","gran","no",6.5,87,{"$f":"Standard!E51","v":6},{"$f":"Standard!F51","v":155},{"$f":"Standard!AU51","v":40},195,"RR n.3 2017"]
[{"$f":"Coltura!A50","v":49},{"$f":"Coltura!B50","v":19},{"$f":"Coltura!C50","v":"E19"},"nd",{"$f":"Coltura!D50","v":"Grano tenero FP/FPS (pianta intera)"},340,180,6.5,"tq","gran","no",6.5,87,{"$f":"Standard!E52","v":6},{"$f":"Standard!F52","v":155},{"$f":"Standard!AU52","v":40},195,"RR n.3 2017"]
[{"$f":"Coltura!A51","v":50},{"$f":"Coltura!B51","v":20},{"$f":"Coltura!C51","v":"E20"},"nd",{"$f":"Coltura!D51","v":"Grano tenero biscottiero  (granella)"},340,180,6.5,"tq","gran","no",6.5,87,{"$f":"Standard!E53","v":6},{"$f":"Standard!F53","v":140},{"$f":"Standard!AU53","v":40},180,"RR n.3 2017"]
[{"$f":"Coltura!A52","v":51},{"$f":"Coltura!B52","v":21},{"$f":"Coltura!C52","v":"E21"},"nd",{"$f":"Coltura!D52","v":"Grano tenero biscottiero pianta intera"},340,180,6.5,"tq","gran","no",6.5,87,{"$f":"Standard!E54","v":6},{"$f":"Standard!F54","v":140},{"$f":"Standard!AU54","v":40},180,"RR n.3 2017"]
[{"$f":"Coltura!A53","v":52},{"$f":"Coltura!B53","v":22},{"$f":"Coltura!C53","v":"E22"},"nd",{"$f":"Coltura!D53","v":"Grano tenero FF (granella)"},340,190,6,"tq","gran","no",6,87,{"$f":"Standard!E55","v":6},{"$f":"Standard!F55","v":160},{"$f":"Standard!AU55","v":40},200,"RR n.3 2017"]
[{"$f":"Coltura!A54","v":53},{"$f":"Coltura!B54","v":23},{"$f":"Coltura!C54","v":"E23"},"nd",{"$f":"Coltura!D54","v":"Grano tenero FF (pianta intera)"},340,190,6,"tq","gran","no",6,87,{"$f":"Standard!E56","v":6},{"$f":"Standard!F56","v":160},{"$f":"Standard!AU56","v":40},200,"RR n.3 2017"]
[{"$f":"Coltura!A55","v":54},{"$f":"Coltura!B55","v":24},{"$f":"Coltura!C55","v":"E24"},"nd",{"$f":"Coltura!D55","v":"Lenticchia"},340,"nd","nd","nd","nd","no",false,89,{"$f":"Standard!E57","v":"nd"},{"$f":"Standard!F57","v":"nd"},{"$f":"Standard!AU57","v":0},{"$error":"#VALUE!"}]
[{"$f":"Coltura!A56","v":55},{"$f":"Coltura!B56","v":25},{"$f":"Coltura!C56","v":"E25"},"nd",{"$f":"Coltura!D56","v":"Lino  fibra"},340,"nd","nd","nd","nd","no",false,90,{"$f":"Standard!E58","v":"nd"},{"$f":"Standard!F58","v":"nd"},{"$f":"Standard!AU58","v":0},{"$error":"#VALUE!"}]
[{"$f":"Coltura!A57","v":56},{"$f":"Coltura!B57","v":26},{"$f":"Coltura!C57","v":"E26"},"nd",{"$f":"Coltura!D57","v":"Lino granella"},340,"nd","nd","nd","nd","no",false,90,{"$f":"Standard!E59","v":"nd"},{"$f":"Standard!F59","v":"nd"},{"$f":"Standard!AU59","v":0},{"$error":"#VALUE!"}]
[{"$f":"Coltura!A58","v":57},{"$f":"Coltura!B58","v":27},{"$f":"Coltura!C58","v":"E27"},"nd",{"$f":"Coltura!D58","v":"Lupino"},340,"nd","nd","nd","nd","no",false,86,{"$f":"Standard!E60","v":"nd"},{"$f":"Standard!F60","v":"nd"},{"$f":"Standard!AU60","v":0},{"$error":"#VALUE!"}]
[{"$f":"Coltura!A59","v":58},{"$f":"Coltura!B59","v":28},{"$f":"Coltura!C59","v":"E28"},"nd",{"$f":"Coltura!D59","v":"Mais da granella 300-400 (granella)"},340,280,13,"tq","gran","no",13,86,{"$f":"Standard!E61","v":7},{"$f":"Standard!F61","v":150},{"$f":"Standard!AU61","v":70},220,"RR n.3 2017"]
[{"$f":"Coltura!A60","v":59},{"$f":"Coltura!B60","v":29},{"$f":"Coltura!C60","v":"E29"},"nd",{"$f":"Coltura!D60","v":"Mais da granella 300-400 (pianta intera)"},340,280,13,"tq","gran","sì",13,86,{"$f":"Standard!E62","v":7},{"$f":"Standard!F62","v":150},{"$f":"Standard!AU62","v":70},220,"RR n.3 2017"]
[{"$f":"Coltura!A61","v":60},{"$f":"Coltura!B61","v":30},{"$f":"Coltura!C61","v":"E30"},"nd",{"$f":"Coltura!D61","v":"Mais da granella 500-700 (granella)"},340,280,13,"tq","gran","sì",13,86,{"$f":"Standard!E63","v":12},{"$f":"Standard!F63","v":240},{"$f":"Standard!AU63","v":70},310,"RR n.3 2017"]
[{"$f":"Coltura!A62","v":61},{"$f":"Coltura!B62","v":31},{"$f":"Coltura!C62","v":"E31"},"nd",{"$f":"Coltura!D62","v":"Mais da granella 500-700 (pianta intera)"},340,280,13,"tq","gran","sì",13,86,{"$f":"Standard!E64","v":12},{"$f":"Standard!F64","v":240},{"$f":"Standard!AU64","v":70},310,"RR n.3 2017"]
[{"$f":"Coltura!A63","v":62},{"$f":"Coltura!B63","v":32},{"$f":"Coltura!C63","v":"E32"},"nd",{"$f":"Coltura!D63","v":"Mais dolce  (spighe)"},340,170,16,"tq","spighe","no",16,27.5,{"$f":"Standard!E65","v":16},{"$f":"Standard!F65","v":170},{"$f":"Standard!AU65","v":40},210,"RR n.3 2017"]
[{"$f":"Coltura!A64","v":63},{"$f":"Coltura!B64","v":33},{"$f":"Coltura!C64","v":"E33"},"nd",{"$f":"Coltura!D64","v":"Mais dolce (pianta intera)"},340,170,16,"tq","spighe","no",16,27.5,{"$f":"Standard!E66","v":16},{"$f":"Standard!F66","v":170},{"$f":"Standard!AU66","v":40},210,"RR n.3 2017"]
[{"$f":"Coltura!A65","v":64},{"$f":"Coltura!B65","v":34},{"$f":"Coltura!C65","v":"E34"},"nd",{"$f":"Coltura!D65","v":"Mais trinciato classe 500"},340,280,23,"s.s.","pianta","sì",76.666666666666671,30,45,150,50,200,"RR n.3 2017"]
[{"$f":"Coltura!A66","v":65},{"$f":"Coltura!B66","v":35},{"$f":"Coltura!C66","v":"E35"},"nd",{"$f":"Coltura!D66","v":"Mais trinciato classe 700"},340,280,23,"s.s.","pianta","sì",76.666666666666671,30,65,240,70,310,"RR n.3 2017"]
[{"$f":"Coltura!A67","v":66},{"$f":"Coltura!B67","v":36},{"$f":"Coltura!C67","v":"E36"},"nd",{"$f":"Coltura!D67","v":"Orzo (granella)"},340,150,6,"tq","gran","no",6,87,{"$f":"Standard!E69","v":6.5},{"$f":"Standard!F69","v":125},{"$f":"Standard!AU69","v":40},165,"RR n.3 2017"]
[{"$f":"Coltura!A68","v":67},{"$f":"Coltura!B68","v":37},{"$f":"Coltura!C68","v":"E37"},"nd",{"$f":"Coltura!D68","v":"Orzo (pianta intera)"},340,150,6,"tq","gran","no",6,87,{"$f":"Standard!E70","v":6.5},{"$f":"Standard!F70","v":125},{"$f":"Standard!AU70","v":40},165,"RR n.3 2017"]
[{"$f":"Coltura!A69","v":68},{"$f":"Coltura!B69","v":38},{"$f":"Coltura!C69","v":"E38"},"nd",{"$f":"Coltura!D69","v":"Panico"},340,"nd","nd","nd","nd","no",false,85,{"$f":"Standard!E71","v":"nd"},{"$f":"Standard!F71","v":"nd"},{"$f":"Standard!AU71","v":0},{"$error":"#VALUE!"}]
[{"$f":"Coltura!A70","v":69},{"$f":"Coltura!B70","v":39},{"$f":"Coltura!C70","v":"E39"},"nd",{"$f":"Coltura!D70","v":"Pisello proteico"},50,"nd","nd","nd","nd","no",false,87,{"$f":"Standard!E72","v":5},{"$f":"Standard!F72","v":40},{"$f":"Standard!AU72","v":20},60,"RR n.3 2017"]
[{"$f":"Coltura!A71","v":70},{"$f":"Coltura!B71","v":40},{"$f":"Coltura!C71","v":"E40"},"nd",{"$f":"Coltura!D71","v":"Pisello proteico + residui"},50,"nd","nd","nd","nd","no",{"$f":"IF(I73=\"tq\",H73,IF(I73=\"s.s.\",(H73/(M73/100))))","v":false},87,{"$f":"Standard!E73","v":5},{"$f":"Standard!F73","v":40},{"$f":"Standard!AU73","v":20},{"$f":"(O73+P73)","v":60},"RR n.3 2017"]
[{"$f":"Coltura!A72","v":71},{"$f":"Coltura!B72","v":41},{"$f":"Coltura!C72","v":"E41"},"nd",{"$f":"Coltura!D72","v":"Rafano (da sovescio)"},340,"nd","nd","nd","nd","no",false,15,{"$f":"Standard!E74","v":"nd"},{"$f":"Standard!F74","v":"nd"},{"$f":"Standard!AU74","v":0},{"$error":"#VALUE!"}]
[{"$f":"Coltura!A73","v":72},{"$f":"Coltura!B73","v":42},{"$f":"Coltura!C73","v":"E42"},"nd",{"$f":"Coltura!D73","v":"Riso (granella)"},340,160,7,"tq","gran","no",7,86,{"$f":"Standard!E75","v":7},{"$f":"Standard!F75","v":110},{"$f":"Standard!AU75","v":40},150,"RR n.3 2017"]
[{"$f":"Coltura!A74","v":73},{"$f":"Coltura!B74","v":43},{"$f":"Coltura!C74","v":"E43"},"nd",{"$f":"Coltura!D74","v":"Riso (granella+paglia)"},340,160,7,"tq","gran","no",7,86,{"$f":"Standard!E76","v":7},{"$f":"Standard!F76","v":110},{"$f":"Standard!AU76","v":40},150,"RR n.3 2017"]
[{"$f":"Coltura!A75","v":74},{"$f":"Coltura!B75","v":44},{"$f":"Coltura!C75","v":"E44"},"nd",{"$f":"Coltura!D75","v":"Segale (granella)"},340,120,4.5,"tq","gran","no",4.5,87,{"$f":"Standard!E77","v":4},{"$f":"Standard!F77","v":100},{"$f":"Standard!AU77","v":50},150,"RR n.3 2017"]
[{"$f":"Coltura!A76","v":75},{"$f":"Coltura!B76","v":45},{"$f":"Coltura!C76","v":"E45"},"nd",{"$f":"Coltura!D76","v":"Segale pianta intera"},340,120,4.5,"tq","gran","no",4.5,87,{"$f":"Standard!E78","v":4},{"$f":"Standard!F78","v":100},{"$f":"Standard!AU78","v":50},150,"RR n.3 2017"]
[{"$f":"Coltura!A77","v":76},{"$f":"Coltura!B77","v":46},{"$f":"Coltura!C77","v":"E46"},"nd",{"$f":"Coltura!D77","v":"Senape indiana"},340,"nd","nd","nd","nd","no",false,90,{"$f":"Standard!E79","v":"nd"},{"$f":"Standard!F79","v":"nd"},{"$f":"Standard!AU79","v":0},{"$error":"#VALUE!"}]
[{"$f":"Coltura!A78","v":77},{"$f":"Coltura!B78","v":47},{"$f":"Coltura!C78","v":"E47"},"nd",{"$f":"Coltura!D78","v":"Soia (granella)"},120,30,3.5,"tq","gran","no",3.5,86,{"$f":"Standard!E80","v":3.5},{"$f":"Standard!F80","v":0},{"$f":"Standard!AU80","v":120},120,"RR n.3 2017"]
[{"$f":"Coltura!A79","v":78},{"$f":"Coltura!B79","v":48},{"$f":"Coltura!C79","v":"E48"},"nd",{"$f":"Coltura!D79","v":"Soia (pianta intera)"},120,30,3.5,"tq","gran","no",3.5,86,{"$f":"Standard!E81","v":3.5},{"$f":"Standard!F81","v":0},{"$f":"Standard!AU81","v":120},120,"RR n.3 2017"]
[{"$f":"Coltura!A80","v":79},{"$f":"Coltura!B80","v":49},{"$f":"Coltura!C80","v":"E49"},"nd",{"$f":"Coltura!D80","v":"Sorgo da foraggio"},340,"nd","nd","nd","nd","no",false,30,{"$f":"Standard!E82","v":"nd"},{"$f":"Standard!F82","v":"nd"},{"$f":"Standard!AU82","v":0},{"$error":"#VALUE!"}]
[{"$f":"Coltura!A81","v":80},{"$f":"Coltura!B81","v":50},{"$f":"Coltura!C81","v":"E50"},"nd",{"$f":"Coltura!D81","v":"Sorgo da granella  (solo granella)"},340,220,7.5,"tq","gran","no",7.5,86,{"$f":"Standard!E83","v":7.5},{"$f":"Standard!F83","v":160},{"$f":"Standard!AU83","v":30},190,"RR n.3 2017"]
[{"$f":"Coltura!A82","v":81},{"$f":"Coltura!B82","v":51},{"$f":"Coltura!C82","v":"E51"},"nd",{"$f":"Coltura!D82","v":"Sorgo da granella (pianta intera)"},340,220,7.5,"tq","gran","no",7.5,86,{"$f":"Standard!E84","v":7.5},{"$f":"Standard!F84","v":160},{"$f":"Standard!AU84","v":30},190,"RR n.3 2017"]
[{"$f":"Coltura!A83","v":82},{"$f":"Coltura!B83","v":52},{"$f":"Coltura!C83","v":"E52"},"nd",{"$f":"Coltura!D83","v":"Tabacco Bright"},340,200,4.4000000000000004,"tq",null,"no",4.4000000000000004,81,{"$f":"Standard!E85","v":"nd"},{"$f":"Standard!F85","v":"nd"},{"$f":"Standard!AU85","v":0},{"$error":"#VALUE!"}]
[{"$f":"Coltura!A84","v":83},{"$f":"Coltura!B84","v":53},{"$f":"Coltura!C84","v":"E53"},"nd",{"$f":"Coltura!D84","v":"Tabacco Bright pianta intera"},340,200,4.4000000000000004,"tq",null,"no",4.4000000000000004,81,{"$f":"Standard!E86","v":"nd"},{"$f":"Standard!F86","v":"nd"},{"$f":"Standard!AU86","v":0},{"$error":"#VALUE!"}]
[{"$f":"Coltura!A85","v":84},{"$f":"Coltura!B85","v":54},{"$f":"Coltura!C85","v":"E54"},"nd",{"$f":"Coltura!D85","v":"Tabacco Burley"},340,200,4.4000000000000004,"tq",null,"no",4.4000000000000004,81,{"$f":"Standard!E87","v":"nd"},{"$f":"Standard!F87","v":"nd"},{"$f":"Standard!AU87","v":0},{"$error":"#VALUE!"}]
[{"$f":"Coltura!A86","v":85},{"$f":"Coltura!B86","v":55},{"$f":"Coltura!C86","v":"E55"},"nd",{"$f":"Coltura!D86","v":"Tabacco Burley pianta intera"},340,200,4.4000000000000004,"tq",null,"no",4.4000000000000004,81,{"$f":"Standard!E88","v":"nd"},{"$f":"Standard!F88","v":"nd"},{"$f":"Standard!AU88","v":0},{"$error":"#VALUE!"}]
[{"$f":"Coltura!A87","v":86},{"$f":"Coltura!B87","v":56},{"$f":"Coltura!C87","v":"E56"},"nd",{"$f":"Coltura!D87","v":"Triticale"},340,150,6,"tq","gran","no",6,87,{"$f":"Standard!E89","v":7.5},{"$f":"Standard!F89","v":140},{"$f":"Standard!AU89","v":50},190,"RR n.3 2017"]
[{"$f":"Coltura!A88","v":87},{"$f":"Coltura!B88","v":57},{"$f":"Coltura!C88","v":"E57"},"nd",{"$f":"Coltura!D88","v":"Triticale pianta intera"},340,150,6,"tq","gran","no",6,87,{"$f":"Standard!E90","v":7.5},{"$f":"Standard!F90","v":140},{"$f":"Standard!AU90","v":50},190,"RR n.3 2017"]
[{"$f":"Coltura!A89","v":88},{"$f":"Coltura!B89","v":1},{"$f":"Coltura!C89","v":"F1"},"nd",{"$f":"Coltura!D89","v":"Avena insilata"},340,"nd","nd","nd","nd","no",false,35,{"$f":"Standard!E91","v":"nd"},{"$f":"Standard!F91","v":"nd"},{"$f":"Standard!AU91","v":0},{"$error":"#VALUE!"}]
[{"$f":"Coltura!A90","v":89},{"$f":"Coltura!B90","v":2},{"$f":"Coltura!C90","v":"F2"},"nd",{"$f":"Coltura!D90","v":"Colza insilato"},340,"nd","nd","nd","nd","no",false,35,{"$f":"Standard!E92","v":"nd"},{"$f":"Standard!F92","v":"nd"},{"$f":"Standard!AU92","v":0},{"$error":"#VALUE!"}]
[{"$f":"Coltura!A91","v":90},{"$f":"Coltura!B91","v":3},{"$f":"Coltura!C91","v":"F3"},"nd",{"$f":"Coltura!D91","v":"Erba mazzolina"},340,300,13,"s.s.","fieno","no",15.294117647058824,85,{"$f":"Standard!E93","v":12.5},{"$f":"Standard!F93","v":200},{"$f":"Standard!AU93","v":50},250,"RR n.3 2017"]
[{"$f":"Coltura!A92","v":91},{"$f":"Coltura!B92","v":4},{"$f":"Coltura!C92","v":"F4"},"nd",{"$f":"Coltura!D92","v":"Erba medica"},100,170,null,null,null,"no",false,85,{"$f":"Standard!E94","v":12.5},{"$f":"Standard!F94","v":0},{"$f":"Standard!AU94","v":100},100,"RR n.3 2017"]
[{"$f":"Coltura!A93","v":92},{"$f":"Coltura!B93","v":5},{"$f":"Coltura!C93","v":"F5"},"nd",{"$f":"Coltura!D93","v":"Erbai aut prim. Di cer. O cruc."},340,120,7,"s.s.","fieno","no",8.2352941176470598,85,{"$f":"Standard!E95","v":"nd"},{"$f":"Standard!F95","v":"nd"},{"$f":"Standard!AU95","v":0},{"$error":"#VALUE!"}]
[{"$f":"Coltura!A94","v":93},{"$f":"Coltura!B94","v":6},{"$f":"Coltura!C94","v":"F6"},"nd",{"$f":"Coltura!D94","v":"Erbai aut prim. Di leguminose"},340,"nd","nd","nd","nd","no",false,85,{"$f":"Standard!E96","v":"nd"},{"$f":"Standard!F96","v":"nd"},{"$f":"Standard!AU96","v":0},{"$error":"#VALUE!"}]
[{"$f":"Coltura!A95","v":94},{"$f":"Coltura!B95","v":7},{"$f":"Coltura!C95","v":"F7"},"nd",{"$f":"Coltura!D95","v":"Erbai biennali o Prati avv. di Graminacee"},340,300,13,"s.s.","fieno","no",15.294117647058824,85,{"$f":"Standard!E97","v":"nd"},{"$f":"Standard!F97","v":"nd"},{"$f":"Standard!AU97","v":0},{"$error":"#VALUE!"}]
[{"$f":"Coltura!A96","v":95},{"$f":"Coltura!B96","v":8},{"$f":"Coltura!C96","v":"F8"},"nd",{"$f":"Coltura!D96","v":"Erbai biennali misti o Prati avv. Polifita"},340,300,13,"s.s.","fieno","no",15.294117647058824,85,{"$f":"Standard!E98","v":"nd"},{"$f":"Standard!F98","v":"nd"},{"$f":"Standard!AU98","v":0},{"$error":"#VALUE!"}]
[{"$f":"Coltura!A97","v":96},{"$f":"Coltura!B97","v":9},{"$f":"Coltura!C97","v":"F9"},"nd",{"$f":"Coltura!D97","v":"Farro insilato"},340,"nd","nd","nd","nd","no",false,35,{"$f":"Standard!E99","v":"nd"},{"$f":"Standard!F99","v":"nd"},{"$f":"Standard!AU99","v":0},{"$error":"#VALUE!"}]
[{"$f":"Coltura!A98","v":97},{"$f":"Coltura!B98","v":10},{"$f":"Coltura!C98","v":"F10"},"nd",{"$f":"Coltura!D98","v":"Festuca arundinacea"},340,300,13,"s.s.","fieno","no",15.294117647058824,85,{"$f":"Standard!E100","v":12.5},{"$f":"Standard!F100","v":200},{"$f":"Standard!AU100","v":50},250,"RR n.3 2017"]
[{"$f":"Coltura!A99","v":98},{"$f":"Coltura!B99","v":11},{"$f":"Coltura!C99","v":"F11"},"nd",{"$f":"Coltura!D99","v":"Fleolo (coda di topo)"},340,"nd","nd","nd","nd","no",false,85,{"$f":"Standard!E101","v":"nd"},{"$f":"Standard!F101","v":"nd"},{"$f":"Standard!AU101","v":0},{"$error":"#VALUE!"}]
[{"$f":"Coltura!A100","v":99},{"$f":"Coltura!B100","v":12},{"$f":"Coltura!C100","v":"F12"},"nd",{"$f":"Coltura!D100","v":"Grano duro  insilato"},340,"nd","nd","nd","nd","no",false,35,{"$f":"Standard!E102","v":"nd"},{"$f":"Standard!F102","v":"nd"},{"$f":"Standard!AU102","v":0},{"$error":"#VALUE!"}]
[{"$f":"Coltura!A101","v":100},{"$f":"Coltura!B101","v":13},{"$f":"Coltura!C101","v":"F13"},"nd",{"$f":"Coltura!D101","v":"Grano tenero  insilato"},340,"nd","nd","nd","nd","no",false,35,{"$f":"Standard!E103","v":"nd"},{"$f":"Standard!F103","v":"nd"},{"$f":"Standard!AU103","v":0},{"$error":"#VALUE!"}]
[{"$f":"Coltura!A102","v":101},{"$f":"Coltura!B102","v":14},{"$f":"Coltura!C102","v":"F14"},"nd",{"$f":"Coltura!D102","v":"Loglio da insilare"},340,"nd","nd","nd","nd","no",false,35,{"$f":"Standard!E104","v":"nd"},{"$f":"Standard!F104","v":"nd"},{"$f":"Standard!AU104","v":0},{"$error":"#VALUE!"}]
[{"$f":"Coltura!A103","v":102},{"$f":"Coltura!B103","v":15},{"$f":"Coltura!C103","v":"F15"},"nd",{"$f":"Coltura!D103","v":"Loiessa"},340,120,7,"s.s.","gran","no",8.2352941176470598,85,{"$f":"Standard!E105","v":"nd"},{"$f":"Standard!F105","v":"nd"},{"$f":"Standard!AU105","v":0},{"$error":"#VALUE!"}]
[{"$f":"Coltura!A104","v":103},{"$f":"Coltura!B104","v":16},{"$f":"Coltura!C104","v":"F16"},"nd",{"$f":"Coltura!D104","v":"Loietto perenne"},340,"nd","nd","nd","nd","no",false,85,{"$f":"Standard!E106","v":"nd"},{"$f":"Standard!F106","v":"nd"},{"$f":"Standard!AU106","v":0},{"$error":"#VALUE!"}]
[{"$f":"Coltura!A105","v":104},{"$f":"Coltura!B105","v":17},{"$f":"Coltura!C105","v":"F17"},"nd",{"$f":"Coltura!D105","v":"Orzo insilato"},340,"nd","nd","nd","nd","no",false,35,{"$f":"Standard!E107","v":"nd"},{"$f":"Standard!F107","v":"nd"},{"$f":"Standard!AU107","v":0},{"$error":"#VALUE!"}]
[{"$f":"Coltura!A106","v":105},{"$f":"Coltura!B106","v":18},{"$f":"Coltura!C106","v":"F18"},"nd",{"$f":"Coltura!D106","v":"Prati di graminacee"},340,300,13,"s.s.","fieno","no",15.294117647058824,85,{"$f":"Standard!E108","v":"nd"},{"$f":"Standard!F108","v":"nd"},{"$f":"Standard!AU108","v":0},{"$error":"#VALUE!"}]
[{"$f":"Coltura!A107","v":106},{"$f":"Coltura!B107","v":19},{"$f":"Coltura!C107","v":"F19"},"nd",{"$f":"Coltura!D107","v":"Prati di trifoglio"},340,170,null,null,null,"no",false,85,{"$f":"Standard!E109","v":"nd"},{"$f":"Standard!F109","v":"nd"},{"$f":"Standard!AU109","v":0},{"$error":"#VALUE!"}]
[{"$f":"Coltura!A108","v":107},{"$f":"Coltura!B108","v":20},{"$f":"Coltura!C108","v":"F20"},"nd",{"$f":"Coltura!D108","v":"Prati pascoli in collina"},340,300,13,"s.s.","fieno","no",15.294117647058824,85,{"$f":"Standard!E110","v":"nd"},{"$f":"Standard!F110","v":"nd"},{"$f":"Standard!AU110","v":0},{"$error":"#VALUE!"}]
[{"$f":"Coltura!A109","v":108},{"$f":"Coltura!B109","v":21},{"$f":"Coltura!C109","v":"F21"},"nd",{"$f":"Coltura!D109","v":"Prati polifiti >50% leguminose"},340,"nd","nd","nd","nd","no",false,85,{"$f":"Standard!E111","v":"nd"},{"$f":"Standard!F111","v":"nd"},{"$f":"Standard!AU111","v":0},{"$error":"#VALUE!"}]
[{"$f":"Coltura!A110","v":109},{"$f":"Coltura!B110","v":22},{"$f":"Coltura!C110","v":"F22"},"nd",{"$f":"Coltura!D110","v":"Prati polifiti"},340,300,13,"s.s.","fieno","no",15.294117647058824,85,{"$f":"Standard!E112","v":8.5},{"$f":"Standard!F112","v":155},{"$f":"Standard!AU112","v":45},200,"RR n.3 2017"]
[{"$f":"Coltura!A111","v":110},{"$f":"Coltura!B111","v":23},{"$f":"Coltura!C111","v":"F23"},"nd",{"$f":"Coltura!D111","v":"Prati stabili in pianura"},340,300,13,"s.s.","fieno","no",15.294117647058824,85,{"$f":"Standard!E113","v":13},{"$f":"Standard!F113","v":140},{"$f":"Standard!AU113","v":20},160,"RR n.3 2017"]
[{"$f":"Coltura!A112","v":111},{"$f":"Coltura!B112","v":24},{"$f":"Coltura!C112","v":"F24"},"nd",{"$f":"Coltura!D112","v":"Prato misto"},340,300,13,"s.s.","fieno","no",15.294117647058824,85,{"$f":"Standard!E114","v":"nd"},{"$f":"Standard!F114","v":"nd"},{"$f":"Standard!AU114","v":0},{"$error":"#VALUE!"}]
[{"$f":"Coltura!A113","v":112},{"$f":"Coltura!B113","v":25},{"$f":"Coltura!C113","v":"F25"},"nd",{"$f":"Coltura!D113","v":"Segale insilato"},340,"nd","nd","nd","nd","no",false,35,{"$f":"Standard!E115","v":"nd"},{"$f":"Standard!F115","v":"nd"},{"$f":"Standard!AU115","v":0},{"$error":"#VALUE!"}]
[{"$f":"Coltura!A114","v":113},{"$f":"Coltura!B114","v":26},{"$f":"Coltura!C114","v":"F26"},"nd",{"$f":"Coltura!D114","v":"Triticale insilato"},340,"nd","nd","nd","nd","no",false,35,{"$f":"Standard!E116","v":"nd"},{"$f":"Standard!F116","v":"nd"},{"$f":"Standard!AU116","v":0},{"$error":"#VALUE!"}]
[{"$f":"Coltura!A115","v":114},{"$f":"Coltura!B115","v":1},{"$f":"Coltura!C115","v":"O1"},"nd",{"$f":"Coltura!D115","v":"Aglio"},340,170,9,"tq","bulbi","no",9,30,{"$f":"Standard!E117","v":9},{"$f":"Standard!F117","v":110},{"$f":"Standard!AU117","v":60},170,"RR n.3 2017"]
[{"$f":"Coltura!A116","v":115},{"$f":"Coltura!B116","v":2},{"$f":"Coltura!C116","v":"O2"},"nd",{"$f":"Coltura!D116","v":"Asparago verde (pianta intera)"},340,210,7,"tq","turrioni","no",7,15,{"$f":"Standard!E118","v":8},{"$f":"Standard!F118","v":160},{"$f":"Standard!AU118","v":30},190,"RR n.3 2017"]
[{"$f":"Coltura!A117","v":116},{"$f":"Coltura!B117","v":3},{"$f":"Coltura!C117","v":"O3"},"nd",{"$f":"Coltura!D117","v":"Basilico media produzione"},340,110,20,"tq",null,"no",20,7.7,{"$f":"Standard!E119","v":20},{"$f":"Standard!F119","v":100},{"$f":"Standard!AU119","v":40},140,"RR n.3 2017"]
[{"$f":"Coltura!A118","v":117},{"$f":"Coltura!B118","v":4},{"$f":"Coltura!C118","v":"O4"},"nd",{"$f":"Coltura!D118","v":"Basilico alta produzione più tagli"},340,{"$f":"Q120","v":160},55,"tq",null,"no",55,null,{"$f":"Standard!E120","v":55},{"$f":"Standard!F120","v":120},{"$f":"Standard!AU120","v":40},160,"Ricalcolato col DPI"]
[{"$f":"Coltura!A119","v":118},{"$f":"Coltura!B119","v":5},{"$f":"Coltura!C119","v":"O5"},"nd",{"$f":"Coltura!D119","v":"Bietola da costa e da foglia m. fresco  media produzione"},340,190,35,"tq",null,"no",35,10.7,{"$f":"Standard!E121","v":25},{"$f":"Standard!F121","v":150},{"$f":"Standard!AU121","v":40},190,"RR n.3 2017"]
[{"$f":"Coltura!A120","v":119},{"$f":"Coltura!B120","v":6},{"$f":"Coltura!C120","v":"O6"},"nd",{"$f":"Coltura!D120","v":"Bietola da costa e da foglia m. fresco  alta produzione più tagli"},340,190,35,"tq",null,"no",35,10.7,{"$f":"Standard!E122","v":35},{"$f":"Standard!F122","v":240},{"$f":"Standard!AU122","v":40},280,"RR n.3 2017"]
[{"$f":"Coltura!A121","v":120},{"$f":"Coltura!B121","v":7},{"$f":"Coltura!C121","v":"O7"},"nd",{"$f":"Coltura!D121","v":"Bietola da foglie per l'industria media produzione più tagli"},340,190,35,"tq",null,"no",{"$f":"IF(I123=\"tq\",H123,IF(I123=\"s.s.\",(H123/(M123/100))))","v":35},10.7,{"$f":"Standard!E123","v":25},{"$f":"Standard!F123","v":190},{"$f":"Standard!AU123","v":40},{"$f":"(O123+P123)","v":230},"RR n.3 2018"]
[{"$f":"Coltura!A122","v":121},{"$f":"Coltura!B122","v":8},{"$f":"Coltura!C122","v":"O8"},"nd",{"$f":"Coltura!D122","v":"Bietola da costa per l'industria alta produzione più tagli"},340,280,25,"tq",null,"no",{"$f":"IF(I124=\"tq\",H124,IF(I124=\"s.s.\",(H124/(M124/100))))","v":25},null,{"$f":"Standard!E124","v":35},{"$f":"Standard!F124","v":240},{"$f":"Standard!AU124","v":40},{"$f":"(O124+P124)","v":280},"RR n.3 2017"]
[{"$f":"Coltura!A123","v":122},{"$f":"Coltura!B123","v":9},{"$f":"Coltura!C123","v":"O9"},"nd",{"$f":"Coltura!D123","v":"Broccoletto  - Cime di rapa"},340,"nd","nd","nd","nd","no",false,8.6,{"$f":"Standard!E125","v":"nd"},{"$f":"Standard!F125","v":"nd"},{"$f":"Standard!AU125","v":0},{"$error":"#VALUE!"}]
[{"$f":"Coltura!A124","v":123},{"$f":"Coltura!B124","v":10},{"$f":"Coltura!C124","v":"O10"},"nd",{"$f":"Coltura!D124","v":"Broccolo media produzione"},340,180,20,"tq",null,"no",20,10,{"$f":"Standard!E126","v":20},{"$f":"Standard!F126","v":130},{"$f":"Standard!AU126","v":50},180,"RR n.3 2017"]
[{"$f":"Coltura!A125","v":124},{"$f":"Coltura!B125","v":11},{"$f":"Coltura!C125","v":"O11"},"nd",{"$f":"Coltura!D125","v":"Broccolo alta produzione"},340,180,20,"tq",null,"no",20,10,{"$f":"Standard!E127","v":32.5},{"$f":"Standard!F127","v":160},{"$f":"Standard!AU127","v":50},210,"RR n.3 2017"]
[{"$f":"Coltura!A126","v":125},{"$f":"Coltura!B126","v":12},{"$f":"Coltura!C126","v":"O12"},"nd",{"$f":"Coltura!D126","v":"Cappuccio media produzione"},340,250,27,"tq",null,"no",27,7.8,{"$f":"Standard!E128","v":27},{"$f":"Standard!F128","v":150},{"$f":"Standard!AU128","v":40},190,"RR n.3 2017"]
[{"$f":"Coltura!A127","v":126},{"$f":"Coltura!B127","v":13},{"$f":"Coltura!C127","v":"O13"},"nd",{"$f":"Coltura!D127","v":"Cappuccio alta produzione"},340,250,27,"tq",null,"no",27,7.8,50,180,40,220,"RR n.3 2017"]
[{"$f":"Coltura!A128","v":127},{"$f":"Coltura!B128","v":14},{"$f":"Coltura!C128","v":"O14"},"nd",{"$f":"Coltura!D128","v":"Carciofo"},340,"nd","nd","nd","nd","no",false,16,{"$f":"Standard!E130","v":15.5},{"$f":"Standard!F130","v":180},{"$f":"Standard!AU130","v":50},230,"RR n.3 2017"]
[{"$f":"Coltura!A129","v":128},{"$f":"Coltura!B129","v":15},{"$f":"Coltura!C129","v":"O15"},"nd",{"$f":"Coltura!D129","v":"Cardo media produzione"},340,"nd","nd","nd","nd","no",false,5.7,{"$f":"Standard!E131","v":25.5},{"$f":"Standard!F131","v":120},{"$f":"Standard!AU131","v":50},170,"calcolato col DPI"]
[{"$f":"Coltura!A130","v":129},{"$f":"Coltura!B130","v":16},{"$f":"Coltura!C130","v":"O16"},"nd",{"$f":"Coltura!D130","v":"Cardo alta produzione"},340,"nd","nd","nd","nd","no",{"$f":"IF(I132=\"tq\",H132,IF(I132=\"s.s.\",(H132/(M132/100))))","v":false},5.7,{"$f":"Standard!E132","v":32.5},{"$f":"Standard!F132","v":150},{"$f":"Standard!AU132","v":50},{"$f":"(O132+P132)","v":200},"calcolato col DPI"]
[{"$f":"Coltura!A131","v":130},{"$f":"Coltura!B131","v":17},{"$f":"Coltura!C131","v":"O17"},"nd",{"$f":"Coltura!D131","v":"Carota"},340,195,55,"tq",null,"no",55,12,{"$f":"Standard!E133","v":50},{"$f":"Standard!F133","v":120},{"$f":"Standard!AU133","v":50},170,"RR n.3 2017"]
[{"$f":"Coltura!A132","v":131},{"$f":"Coltura!B132","v":18},{"$f":"Coltura!C132","v":"O18"},"nd",{"$f":"Coltura!D132","v":"Cavolfiore media produzione"},340,225,35,"tq",null,"no",35,9.5,{"$f":"Standard!E134","v":35},{"$f":"Standard!F134","v":150},{"$f":"Standard!AU134","v":40},190,"RR n.3 2017"]
[{"$f":"Coltura!A133","v":132},{"$f":"Coltura!B133","v":19},{"$f":"Coltura!C133","v":"O19"},"nd",{"$f":"Coltura!D133","v":"Cavolfiore alta produzione"},340,225,35,"tq",null,"no",35,9.5,{"$f":"Standard!E135","v":45},{"$f":"Standard!F135","v":180},{"$f":"Standard!AU135","v":40},220,"RR n.3 2017"]
[{"$f":"Coltura!A134","v":133},{"$f":"Coltura!B134","v":20},{"$f":"Coltura!C134","v":"O20"},"nd",{"$f":"Coltura!D134","v":"Cavolo verza mercato media produzione"},340,165,30,"tq",null,"no",{"$f":"IF(I136=\"tq\",H136,IF(I136=\"s.s.\",(H136/(M136/100))))","v":30},9.5,{"$f":"Standard!E136","v":24},{"$f":"Standard!F136","v":130},{"$f":"Standard!AU136","v":50},{"$f":"(O136+P136)","v":180},"RR n.3 2017"]
[{"$f":"Coltura!A135","v":134},{"$f":"Coltura!B135","v":21},{"$f":"Coltura!C135","v":"O21"},"nd",{"$f":"Coltura!D135","v":"Cavolo verza mercato alta produzione"},340,165,30,"tq",null,"no",30,9.5,{"$f":"Standard!E137","v":50},{"$f":"Standard!F137","v":160},{"$f":"Standard!AU137","v":50},210,"RR n.3 2017"]
[{"$f":"Coltura!A136","v":135},{"$f":"Coltura!B136","v":22},{"$f":"Coltura!C136","v":"O22"},"nd",{"$f":"Coltura!D136","v":"Cavolo Riccio, Cavolo nero e Cavolo Rapa"},340,180,20,"tq","nd","no",20,9.5,{"$f":"Standard!E138","v":20},{"$f":"Standard!F138","v":130},{"$f":"Standard!AU138","v":50},180,"calcolato col DPI"]
[{"$f":"Coltura!A137","v":136},{"$f":"Coltura!B137","v":23},{"$f":"Coltura!C137","v":"O23"},"nd",{"$f":"Coltura!D137","v":"Cetriolo da mensa media produzione"},340,225,25,"tq",null,"no",25,5,{"$f":"Standard!E139","v":120},{"$f":"Standard!F139","v":175},{"$f":"Standard!AU139","v":40},215,"RR n.3 2017"]
[{"$f":"Coltura!A138","v":137},{"$f":"Coltura!B138","v":24},{"$f":"Coltura!C138","v":"O24"},"nd",{"$f":"Coltura!D138","v":"Cetriolo da mensa alta produzione"},340,225,25,"tq",null,"no",{"$f":"IF(I140=\"tq\",H140,IF(I140=\"s.s.\",(H140/(M140/100))))","v":25},5,{"$f":"Standard!E140","v":150},{"$f":"Standard!F140","v":210},{"$f":"Standard!AU140","v":40},{"$f":"(O140+P140)","v":250},"RR n.3 2017"]
[{"$f":"Coltura!A139","v":138},{"$f":"Coltura!B139","v":25},{"$f":"Coltura!C139","v":"O25"},"nd",{"$f":"Coltura!D139","v":"Cicoria da mercato media produzione"},340,210,32,"tq",null,"no",32,6.6,{"$f":"Standard!E141","v":28},{"$f":"Standard!F141","v":140},{"$f":"Standard!AU141","v":40},180,"RR n.3 2017"]
[{"$f":"Coltura!A140","v":139},{"$f":"Coltura!B140","v":26},{"$f":"Coltura!C140","v":"O26"},"nd",{"$f":"Coltura!D140","v":"Cicoria da mercato alta produzione"},340,210,32,"tq",null,"no",{"$f":"IF(I142=\"tq\",H142,IF(I142=\"s.s.\",(H142/(M142/100))))","v":32},6.6,{"$f":"Standard!E142","v":37.5},{"$f":"Standard!F142","v":165},{"$f":"Standard!AU142","v":40},{"$f":"(O142+P142)","v":205},"RR n.3 2017"]
[{"$f":"Coltura!A141","v":140},{"$f":"Coltura!B141","v":27},{"$f":"Coltura!C141","v":"O27"},"nd",{"$f":"Coltura!D141","v":"Cicoria da industria alta produzione più tagli"},340,210,32,"tq",null,"no",{"$f":"IF(I143=\"tq\",H143,IF(I143=\"s.s.\",(H143/(M143/100))))","v":32},6.6,{"$f":"Standard!E143","v":28},{"$f":"Standard!F143","v":170},{"$f":"Standard!AU143","v":40},{"$f":"(O143+P143)","v":210},"RR n.3 2017"]
[{"$f":"Coltura!A142","v":141},{"$f":"Coltura!B142","v":28},{"$f":"Coltura!C142","v":"O28"},"nd",{"$f":"Coltura!D142","v":"Cipolla"},340,160,35,"tq",null,"no",35,7.9,{"$f":"Standard!E144","v":45},{"$f":"Standard!F144","v":130},{"$f":"Standard!AU144","v":50},180,"RR n.3 2017"]
[{"$f":"Coltura!A143","v":142},{"$f":"Coltura!B143","v":29},{"$f":"Coltura!C143","v":"O29"},"nd",{"$f":"Coltura!D143","v":"Cocomero"},340,130,60,"tq",null,"no",60,5,{"$f":"Standard!E145","v":60},{"$f":"Standard!F145","v":100},{"$f":"Standard!AU145","v":30},130,"RR n.3 2017"]
[{"$f":"Coltura!A144","v":143},{"$f":"Coltura!B144","v":30},{"$f":"Coltura!C144","v":"O30"},"nd",{"$f":"Coltura!D144","v":"Endivie (indivie riccia e scarola) media produzione"},340,130,35,"tq",null,"no",35,null,{"$f":"Standard!E146","v":34},{"$f":"Standard!F146","v":130},{"$f":"Standard!AU146","v":40},170,"RR n.3 2017"]
[{"$f":"Coltura!A145","v":144},{"$f":"Coltura!B145","v":31},{"$f":"Coltura!C145","v":"O31"},"nd",{"$f":"Coltura!D145","v":"Endivie (indivie riccia e scarola) alta produzione"},340,130,35,"tq",null,"no",{"$f":"IF(I147=\"tq\",H147,IF(I147=\"s.s.\",(H147/(M147/100))))","v":35},null,{"$f":"Standard!E147","v":45},{"$f":"Standard!F147","v":160},{"$f":"Standard!AU147","v":40},{"$f":"(O147+P147)","v":200},"RR n.3 2017"]
[{"$f":"Coltura!A146","v":145},{"$f":"Coltura!B146","v":32},{"$f":"Coltura!C146","v":"O32"},"nd",{"$f":"Coltura!D146","v":"Fagiolino"},340,70,9,"tq",null,"no",9,null,{"$f":"Standard!E148","v":9},{"$f":"Standard!F148","v":70},{"$f":"Standard!AU148","v":25},95,"RR n.3 2017"]
[{"$f":"Coltura!A147","v":146},{"$f":"Coltura!B147","v":33},{"$f":"Coltura!C147","v":"O33"},"nd",{"$f":"Coltura!D147","v":"Fagiolo in baccelli da sgranare"},340,70,4,"tq",null,"no",{"$f":"IF(I149=\"tq\",H149,IF(I149=\"s.s.\",(H149/(M149/100))))","v":4},50,{"$f":"Standard!E149","v":5},{"$f":"Standard!F149","v":70},{"$f":"Standard!AU149","v":25},{"$f":"(O149+P149)","v":95},"RR n.3 2017"]
[{"$f":"Coltura!A148","v":147},{"$f":"Coltura!B148","v":34},{"$f":"Coltura!C148","v":"O34"},"nd",{"$f":"Coltura!D148","v":"Fagiolo secco"},340,"nd","nd","nd","nd","no",false,86,{"$f":"Standard!E150","v":"nd"},{"$f":"Standard!F150","v":"nd"},{"$f":"Standard!AU150","v":0},{"$error":"#VALUE!"}]
[{"$f":"Coltura!A149","v":148},{"$f":"Coltura!B149","v":35},{"$f":"Coltura!C149","v":"O35"},"nd",{"$f":"Coltura!D149","v":"Fava da consumo fresco"},340,"nd","nd","nd","nd","no",false,16,{"$f":"Standard!E151","v":"nd"},{"$f":"Standard!F151","v":"nd"},{"$f":"Standard!AU151","v":0},{"$error":"#VALUE!"}]
[{"$f":"Coltura!A150","v":149},{"$f":"Coltura!B150","v":36},{"$f":"Coltura!C150","v":"O36"},"nd",{"$f":"Coltura!D150","v":"Finocchio"},340,240,38,"tq",null,"no",38,6.8,{"$f":"Standard!E152","v":30},{"$f":"Standard!F152","v":160},{"$f":"Standard!AU152","v":50},210,"RR n.3 2017"]
[{"$f":"Coltura!A151","v":150},{"$f":"Coltura!B151","v":37},{"$f":"Coltura!C151","v":"O37"},"nd",{"$f":"Coltura!D151","v":"Fragola "},340,160,35,"tq",null,"no",35,10,{"$f":"Standard!E153","v":30},{"$f":"Standard!F153","v":120},{"$f":"Standard!AU153","v":40},160,"RR n.3 2017"]
[{"$f":"Coltura!A152","v":151},{"$f":"Coltura!B152","v":38},{"$f":"Coltura!C152","v":"O38"},"nd",{"$f":"Coltura!D152","v":"Lattuga"},340,130,30,"tq",null,"no",30,5.7,{"$f":"Standard!E154","v":32},{"$f":"Standard!F154","v":110},{"$f":"Standard!AU154","v":40},150,"RR n.3 2017"]
[{"$f":"Coltura!A153","v":152},{"$f":"Coltura!B153","v":39},{"$f":"Coltura!C153","v":"O39"},"nd",{"$f":"Coltura!D153","v":"Lattuga coltura protetta"},340,"nd","nd","nd","nd","no",false,null,{"$f":"Standard!E155","v":"nd"},{"$f":"Standard!F155","v":"nd"},{"$f":"Standard!AU155","v":0},{"$error":"#VALUE!"}]
[{"$f":"Coltura!A154","v":153},{"$f":"Coltura!B154","v":40},{"$f":"Coltura!C154","v":"O40"},"nd",{"$f":"Coltura!D154","v":"Melanzana in pieno campo media produzione"},340,175,70,"tq",null,"no",{"$f":"IF(I156=\"tq\",H156,IF(I156=\"s.s.\",(H156/(M156/100))))","v":70},7.3,{"$f":"Standard!E156","v":80},{"$f":"Standard!F156","v":250},{"$f":"Standard!AU156","v":50},{"$f":"(O156+P156)","v":300},"RR n.3 2017"]
[{"$f":"Coltura!A155","v":154},{"$f":"Coltura!B155","v":41},{"$f":"Coltura!C155","v":"O41"},"nd",{"$f":"Coltura!D155","v":"Melanzana coltura protetta alta produzione"},340,175,70,"tq",null,"no",70,7.3,{"$f":"Standard!E157","v":150},{"$f":"Standard!F157","v":300},{"$f":"Standard!AU157","v":50},350,"RR n.3 2017"]
[{"$f":"Coltura!A156","v":155},{"$f":"Coltura!B156","v":42},{"$f":"Coltura!C156","v":"O42"},"nd",{"$f":"Coltura!D156","v":"Melone"},340,140,35,"tq",null,"no",35,null,{"$f":"Standard!E158","v":40},{"$f":"Standard!F158","v":120},{"$f":"Standard!AU158","v":40},160,"RR n.3 2017"]
[{"$f":"Coltura!A157","v":156},{"$f":"Coltura!B157","v":43},{"$f":"Coltura!C157","v":"O43"},"nd",{"$f":"Coltura!D157","v":"Patata"},340,190,48,"tq",null,"no",48,21.5,{"$f":"Standard!E159","v":47.5},{"$f":"Standard!F159","v":190},{"$f":"Standard!AU159","v":40},230,"RR n.3 2017"]
[{"$f":"Coltura!A158","v":157},{"$f":"Coltura!B158","v":44},{"$f":"Coltura!C158","v":"O44"},"nd",{"$f":"Coltura!D158","v":"Peperone in serra alta produzione"},340,200,50,"tq",null,"no",50,7.7,{"$f":"Standard!E160","v":70},{"$f":"Standard!F160","v":190},{"$f":"Standard!AU160","v":40},230,"RR n.3 2017"]
[{"$f":"Coltura!A159","v":158},{"$f":"Coltura!B159","v":45},{"$f":"Coltura!C159","v":"O45"},"nd",{"$f":"Coltura!D159","v":"Peperone in serra media produzione"},340,200,50,"tq",null,"no",50,null,{"$f":"Standard!E161","v":50},{"$f":"Standard!F161","v":160},{"$f":"Standard!AU161","v":40},200]
[{"$f":"Coltura!A160","v":159},{"$f":"Coltura!B160","v":46},{"$f":"Coltura!C160","v":"O46"},"nd",{"$f":"Coltura!D160","v":"Piccoli frutti"},340,200,50,"tq",null,"no",{"$f":"IF(I162=\"tq\",H162,IF(I162=\"s.s.\",(H162/(M162/100))))","v":50},null,{"$f":"Standard!E162","v":"nd"},{"$f":"Standard!F162","v":"nd"},{"$f":"Standard!AU162","v":0},{"$f":"(O162+P162)","v":{"$error":"#VALUE!"}}]
[{"$f":"Coltura!A161","v":160},{"$f":"Coltura!B161","v":47},{"$f":"Coltura!C161","v":"O47"},"nd",{"$f":"Coltura!D161","v":"Pisello da industria (grani)"},340,"nd",null,null,null,"no",false,null,{"$f":"Standard!E163","v":6},{"$f":"Standard!F163","v":50},{"$f":"Standard!AU163","v":20},70]
[{"$f":"Coltura!A162","v":161},{"$f":"Coltura!B162","v":48},{"$f":"Coltura!C162","v":"O48"},"nd",{"$f":"Coltura!D162","v":"Pisello da mercato fresco (baccelli)"},340,"nd","nd","nd","nd","no",false,20,{"$f":"Standard!E164","v":6},{"$f":"Standard!F164","v":50},{"$f":"Standard!AU164","v":20},70,"RR n.3 2017"]
[{"$f":"Coltura!A163","v":162},{"$f":"Coltura!B163","v":49},{"$f":"Coltura!C163","v":"O49"},"nd",{"$f":"Coltura!D163","v":"Pomodoro da industria media produzione"},340,180,80,"tq",null,"no",80,8,{"$f":"Standard!E165","v":70},{"$f":"Standard!F165","v":130},{"$f":"Standard!AU165","v":40},170,"RR n.3 2017"]
[{"$f":"Coltura!A164","v":163},{"$f":"Coltura!B164","v":50},{"$f":"Coltura!C164","v":"O50"},"nd",{"$f":"Coltura!D164","v":"Pomodoro da industria alta produzione"},340,180,80,"tq",null,"no",80,8,{"$f":"Standard!E166","v":90},{"$f":"Standard!F166","v":150},{"$f":"Standard!AU166","v":40},190]
[{"$f":"Coltura!A165","v":164},{"$f":"Coltura!B165","v":51},{"$f":"Coltura!C165","v":"O51"},"nd",{"$f":"Coltura!D165","v":"Pomodoro da mensa a pieno campo"},340,180,80,"tq",null,"no",80,8,{"$f":"Standard!E167","v":70},{"$f":"Standard!F167","v":130},{"$f":"Standard!AU167","v":40},170,"RR n.3 2017"]
[{"$f":"Coltura!A166","v":165},{"$f":"Coltura!B166","v":52},{"$f":"Coltura!C166","v":"O52"},"nd",{"$f":"Coltura!D166","v":"Pomodoro da mensa in serra"},340,180,80,"tq",null,"no",80,8,{"$f":"Standard!E168","v":115},{"$f":"Standard!F168","v":230},{"$f":"Standard!AU168","v":40},270,"RR n.3 2017"]
[{"$f":"Coltura!A167","v":166},{"$f":"Coltura!B167","v":53},{"$f":"Coltura!C167","v":"O53"},"nd",{"$f":"Coltura!D167","v":"Porro"},340,126,35,"tq",null,"no",35,null,{"$f":"Standard!E169","v":40},{"$f":"Standard!F169","v":"nd"},{"$f":"Standard!AU169","v":0},{"$error":"#VALUE!"},"RR n.3 2017"]
[{"$f":"Coltura!A168","v":167},{"$f":"Coltura!B168","v":54},{"$f":"Coltura!C168","v":"O54"},"nd",{"$f":"Coltura!D168","v":"Prezzemolo media produzione"},340,100,20,"tq",null,"no",20,12.2,{"$f":"Standard!E170","v":20},{"$f":"Standard!F170","v":80},{"$f":"Standard!AU170","v":30},110,"RR n.3 2018"]
[{"$f":"Coltura!A169","v":168},{"$f":"Coltura!B169","v":55},{"$f":"Coltura!C169","v":"O55"},"nd",{"$f":"Coltura!D169","v":"Prezzemolo alta produzione più tagli"},340,100,20,"tq",null,"no",20,12.2,{"$f":"Standard!E171","v":43.5},{"$f":"Standard!F171","v":90},{"$f":"Standard!AU171","v":30},120,"RR n.3 2017"]
[{"$f":"Coltura!A170","v":169},{"$f":"Coltura!B170","v":56},{"$f":"Coltura!C170","v":"O56"},"nd",{"$f":"Coltura!D170","v":"Radicchio (cicoria a foglie colorate) media produzione"},340,190,20,"tq",null,"no",20,11.9,{"$f":"Standard!E172","v":20},{"$f":"Standard!F172","v":130},{"$f":"Standard!AU172","v":30},160,"RR n.3 2017"]
[{"$f":"Coltura!A171","v":170},{"$f":"Coltura!B171","v":57},{"$f":"Coltura!C171","v":"O57"},"nd",{"$f":"Coltura!D171","v":"Radicchio (cicoria a foglie colorate) alta produzione"},340,190,20,"tq",null,"no",{"$f":"IF(I173=\"tq\",H173,IF(I173=\"s.s.\",(H173/(M173/100))))","v":20},11.9,{"$f":"Standard!E173","v":35},{"$f":"Standard!F173","v":150},{"$f":"Standard!AU173","v":30},{"$f":"(O173+P173)","v":180},"RR n.3 2018"]
[{"$f":"Coltura!A172","v":171},{"$f":"Coltura!B172","v":58},{"$f":"Coltura!C172","v":"O58"},"nd",{"$f":"Coltura!D172","v":"Rapa"},340,"nd","nd","nd","nd","no",false,6.7,{"$f":"Standard!E174","v":35},{"$f":"Standard!F174","v":"nd"},{"$f":"Standard!AU174","v":0},{"$error":"#VALUE!"}]
[{"$f":"Coltura!A173","v":172},{"$f":"Coltura!B173","v":59},{"$f":"Coltura!C173","v":"O59"},"nd",{"$f":"Coltura!D173","v":"Ravanello"},340,80,30,"tq",null,"no",30,5.4,{"$f":"Standard!E175","v":30},{"$f":"Standard!F175","v":80},{"$f":"Standard!AU175","v":25},105,"RR n.3 2017"]
[{"$f":"Coltura!A174","v":173},{"$f":"Coltura!B174","v":60},{"$f":"Coltura!C174","v":"O60"},"nd",{"$f":"Coltura!D174","v":"Rucola media produzione"},340,130,30,"tq",null,"no",{"$f":"IF(I176=\"tq\",H176,IF(I176=\"s.s.\",(H176/(M176/100))))","v":30},5.7,{"$f":"Standard!E176","v":18.5},{"$f":"Standard!F176","v":110},{"$f":"Standard!AU176","v":30},{"$f":"(O176+P176)","v":140},"calcolato col DPI"]
[{"$f":"Coltura!A175","v":174},{"$f":"Coltura!B175","v":61},{"$f":"Coltura!C175","v":"O61"},"nd",{"$f":"Coltura!D175","v":"Rucola alta produzione con più tagli"},340,150,30,"tq",null,"no",30,5.7,{"$f":"Standard!E177","v":37},{"$f":"Standard!F177","v":120},{"$f":"Standard!AU177","v":30},150,"calcolato col DPI"]
[{"$f":"Coltura!A176","v":175},{"$f":"Coltura!B176","v":62},{"$f":"Coltura!C176","v":"O62"},"nd",{"$f":"Coltura!D176","v":"Scalogno"},340,120,8,"tq",null,"no",8,null,{"$f":"Standard!E178","v":8},{"$f":"Standard!F178","v":90},{"$f":"Standard!AU178","v":40},130,"RR n.3 2017"]
[{"$f":"Coltura!A177","v":176},{"$f":"Coltura!B177","v":63},{"$f":"Coltura!C177","v":"O63"},"nd",{"$f":"Coltura!D177","v":"Sedano media produzione"},340,250,80,"tq",null,"no",{"$f":"IF(I179=\"tq\",H179,IF(I179=\"s.s.\",(H179/(M179/100))))","v":80},11.7,{"$f":"Standard!E179","v":50},{"$f":"Standard!F179","v":240},{"$f":"Standard!AU179","v":50},{"$f":"(O179+P179)","v":290},"RR n.3 2015"]
[{"$f":"Coltura!A178","v":177},{"$f":"Coltura!B178","v":64},{"$f":"Coltura!C178","v":"O64"},"nd",{"$f":"Coltura!D178","v":"Sedano alta produzione"},340,250,80,"tq",null,"no",80,11.7,{"$f":"Standard!E180","v":80},{"$f":"Standard!F180","v":270},{"$f":"Standard!AU180","v":50},320,"RR n.3 2016"]
[{"$f":"Coltura!A179","v":178},{"$f":"Coltura!B179","v":65},{"$f":"Coltura!C179","v":"O65"},"nd",{"$f":"Coltura!D179","v":"Spinacio alta produzione con più tagli"},340,190,20,"tq",null,"no",20,null,{"$f":"Standard!E181","v":27.5},{"$f":"Standard!F181","v":180},{"$f":"Standard!AU181","v":40},220,"RR n.3 2017"]
[{"$f":"Coltura!A180","v":179},{"$f":"Coltura!B180","v":66},{"$f":"Coltura!C180","v":"O66"},"nd",{"$f":"Coltura!D180","v":"Spinacio media produzione"},340,125,13,"tq",null,"no",13,9.9,{"$f":"Standard!E182","v":20},{"$f":"Standard!F182","v":150},{"$f":"Standard!AU182","v":40},190,"RR n.3 2018"]
[{"$f":"Coltura!A181","v":180},{"$f":"Coltura!B181","v":67},{"$f":"Coltura!C181","v":"O67"},"nd",{"$f":"Coltura!D181","v":"Verza - cavolo da mercato media produzione"},340,150,35,"tq",null,"no",35,9.3000000000000007,{"$f":"Standard!E183","v":24},{"$f":"Standard!F183","v":130},{"$f":"Standard!AU183","v":50},180,"RR n.3 2017"]
[{"$f":"Coltura!A182","v":181},{"$f":"Coltura!B182","v":68},{"$f":"Coltura!C182","v":"O68"},"nd",{"$f":"Coltura!D182","v":"Verza - cavolo da mercato alta produzione"},340,150,35,"tq",null,"no",{"$f":"IF(I184=\"tq\",H184,IF(I184=\"s.s.\",(H184/(M184/100))))","v":35},9.3000000000000007,{"$f":"Standard!E184","v":50},{"$f":"Standard!F184","v":160},{"$f":"Standard!AU184","v":50},{"$f":"(O184+P184)","v":210},"RR n.3 2018"]
[{"$f":"Coltura!A183","v":182},{"$f":"Coltura!B183","v":69},{"$f":"Coltura!C183","v":"O69"},"nd",{"$f":"Coltura!D183","v":"Verza da industria"},340,150,35,"tq",null,"no",35,9.3000000000000007,{"$f":"Standard!E185","v":35},{"$f":"Standard!F185","v":150},{"$f":"Standard!AU185","v":40},190,"RR n.3 2017"]
[{"$f":"Coltura!A184","v":183},{"$f":"Coltura!B184","v":70},{"$f":"Coltura!C184","v":"O70"},"nd",{"$f":"Coltura!D184","v":"Zucca"},340,210,40,"tq",null,"no",40,5.6,{"$f":"Standard!E186","v":35},{"$f":"Standard!F186","v":110},{"$f":"Standard!AU186","v":30},140,"RR n.3 2017"]
[{"$f":"Coltura!A185","v":184},{"$f":"Coltura!B185","v":71},{"$f":"Coltura!C185","v":"O71"},"nd",{"$f":"Coltura!D185","v":"Zucchino da industria media produzione"},340,190,50,"tq",null,"no",50,null,{"$f":"Standard!E187","v":50},{"$f":"Standard!F187","v":175},{"$f":"Standard!AU187","v":40},215,"RR n.3 2017"]
[{"$f":"Coltura!A186","v":185},{"$f":"Coltura!B186","v":72},{"$f":"Coltura!C186","v":"O72"},"nd",{"$f":"Coltura!D186","v":"Zucchino da industria alta produzione"},340,190,50,"tq",null,"no",{"$f":"IF(I188=\"tq\",H188,IF(I188=\"s.s.\",(H188/(M188/100))))","v":50},null,{"$f":"Standard!E188","v":65},{"$f":"Standard!F188","v":200},{"$f":"Standard!AU188","v":40},{"$f":"(O188+P188)","v":240},"RR n.3 2018"]
[{"$f":"Coltura!A187","v":186},{"$f":"Coltura!B187","v":73},{"$f":"Coltura!C187","v":"O73"},"nd",{"$f":"Coltura!D187","v":"Zucchino da mercato fresco media produzione"},340,190,50,"tq",null,"no",50,6.4,{"$f":"Standard!E189","v":40},{"$f":"Standard!F189","v":150},{"$f":"Standard!AU189","v":40},190,"RR n.3 2017"]
[{"$f":"Coltura!A188","v":187},{"$f":"Coltura!B188","v":74},{"$f":"Coltura!C188","v":"O74"},"nd",{"$f":"Coltura!D188","v":"Zucchino da mercato  fresco alta produzione"},340,190,50,"tq",null,"no",{"$f":"IF(I190=\"tq\",H190,IF(I190=\"s.s.\",(H190/(M190/100))))","v":50},7.4,{"$f":"Standard!E190","v":50},{"$f":"Standard!F190","v":180},{"$f":"Standard!AU190","v":40},{"$f":"(O190+P190)","v":220},"RR n.3 2018"]
[{"$f":"Coltura!A189","v":188},{"$f":"Coltura!B189","v":1},{"$f":"Coltura!C189","v":"S1"},"nd",{"$f":"Coltura!D189","v":"Barbabiertola da seme (fase porta seme)"},340,"nd","nd",null,"seme","no",false,null,{"$f":"Standard!E191","v":"nd"},{"$f":"Standard!F191","v":140},{"$f":"Standard!AU191","v":40},180,"RR n.3 2017"]
[{"$f":"Coltura!A190","v":189},{"$f":"Coltura!B190","v":2},{"$f":"Coltura!C190","v":"S2"},"nd",{"$f":"Coltura!D190","v":"Carota da seme (fase portaseme)"},340,"nd","nd",null,"seme","no",false,null,{"$f":"Standard!E192","v":"nd"},{"$f":"Standard!F192","v":120},{"$f":"Standard!AU192","v":30},150,"RR n.3 2017"]
[{"$f":"Coltura!A191","v":190},{"$f":"Coltura!B191","v":3},{"$f":"Coltura!C191","v":"S3"},"nd",{"$f":"Coltura!D191","v":"Carota da seme (fase vivaio)"},340,"nd","nd",null,"tubero","no",false,null,{"$f":"Standard!E193","v":50},{"$f":"Standard!F193","v":120},{"$f":"Standard!AU193","v":35},155,"RR n.3 2017"]
[{"$f":"Coltura!A192","v":191},{"$f":"Coltura!B192","v":4},{"$f":"Coltura!C192","v":"S4"},"nd",{"$f":"Coltura!D192","v":"Cavoli da seme"},340,"nd","nd",null,"seme","no",false,null,{"$f":"Standard!E194","v":"nd"},{"$f":"Standard!F194","v":160},{"$f":"Standard!AU194","v":40},200,"RR n.3 2017"]
[{"$f":"Coltura!A193","v":192},{"$f":"Coltura!B193","v":5},{"$f":"Coltura!C193","v":"S5"},"nd",{"$f":"Coltura!D193","v":"Cetriolo da seme"},340,"nd","nd",null,"seme","no",false,null,{"$f":"Standard!E195","v":"nd"},{"$f":"Standard!F195","v":180},{"$f":"Standard!AU195","v":40},220,"RR n.3 2017"]
[{"$f":"Coltura!A194","v":193},{"$f":"Coltura!B194","v":6},{"$f":"Coltura!C194","v":"S6"},"nd",{"$f":"Coltura!D194","v":"Cicoria da seme"},340,"nd","nd",null,"seme","no",false,null,{"$f":"Standard!E196","v":"nd"},{"$f":"Standard!F196","v":140},{"$f":"Standard!AU196","v":40},180,"RR n.3 2017"]
[{"$f":"Coltura!A195","v":194},{"$f":"Coltura!B195","v":7},{"$f":"Coltura!C195","v":"S7"},"nd",{"$f":"Coltura!D195","v":"Cipolla da seme (fase portaseme)"},340,"nd","nd",null,"seme","no",false,null,{"$f":"Standard!E197","v":"nd"},{"$f":"Standard!F197","v":130},{"$f":"Standard!AU197","v":30},160,"RR n.3 2017"]
[{"$f":"Coltura!A196","v":195},{"$f":"Coltura!B196","v":8},{"$f":"Coltura!C196","v":"S8"},"nd",{"$f":"Coltura!D196","v":"Cipolla da seme (fase vivaio)"},340,"nd","nd",null,"bulbi","no",false,null,{"$f":"Standard!E198","v":45},{"$f":"Standard!F198","v":130},{"$f":"Standard!AU198","v":40},170,"RR n.3 2017"]
[{"$f":"Coltura!A197","v":196},{"$f":"Coltura!B197","v":9},{"$f":"Coltura!C197","v":"S9"},"nd",{"$f":"Coltura!D197","v":"Coriandolo da seme"},340,"nd","nd",null,"seme","no",false,null,{"$f":"Standard!E199","v":"nd"},{"$f":"Standard!F199","v":70},{"$f":"Standard!AU199","v":20},90,"RR n.3 2017"]
[{"$f":"Coltura!A198","v":197},{"$f":"Coltura!B198","v":10},{"$f":"Coltura!C198","v":"S10"},"nd",{"$f":"Coltura!D198","v":"Erba medica  da seme"},340,"nd","nd",null,"seme","no",false,null,{"$f":"Standard!E200","v":"nd"},{"$f":"Standard!F200","v":0},{"$f":"Standard!AU200","v":100},100,"RR n.3 2017"]
[{"$f":"Coltura!A199","v":198},{"$f":"Coltura!B199","v":11},{"$f":"Coltura!C199","v":"S11"},"nd",{"$f":"Coltura!D199","v":"Finocchio da seme"},340,"nd","nd",null,"seme","no",false,null,{"$f":"Standard!E201","v":"nd"},{"$f":"Standard!F201","v":100},{"$f":"Standard!AU201","v":20},120,"RR n.3 2017"]
[{"$f":"Coltura!A200","v":199},{"$f":"Coltura!B200","v":12},{"$f":"Coltura!C200","v":"S12"},"nd",{"$f":"Coltura!D200","v":"Frumento duro da seme (granella)"},340,190,6,"tq","gran","no",6,87,{"$f":"Standard!E202","v":6},{"$f":"Standard!F202","v":160},{"$f":"Standard!AU202","v":30},190,"RR n.3 2017"]
[{"$f":"Coltura!A201","v":200},{"$f":"Coltura!B201","v":13},{"$f":"Coltura!C201","v":"S13"},"nd",{"$f":"Coltura!D201","v":"Frumento tenero da seme (granella)"},340,180,6.5,"tq","gran","no",6.5,87,{"$f":"Standard!E203","v":6},{"$f":"Standard!F203","v":140},{"$f":"Standard!AU203","v":40},180,"RR n.3 2017"]
[{"$f":"Coltura!A202","v":201},{"$f":"Coltura!B202","v":14},{"$f":"Coltura!C202","v":"S14"},"nd",{"$f":"Coltura!D202","v":"Girasole da seme (granella)"},340,120,3.5,"tq","gran","no",3.5,90,{"$f":"Standard!E204","v":3},{"$f":"Standard!F204","v":90},{"$f":"Standard!AU204","v":40},130,"RR n.3 2017"]
[{"$f":"Coltura!A203","v":202},{"$f":"Coltura!B203","v":15},{"$f":"Coltura!C203","v":"S15"},"nd",{"$f":"Coltura!D203","v":"Lattuga da seme"},340,130,null,null,"seme","no",false,null,{"$f":"Standard!E205","v":"nd"},{"$f":"Standard!F205","v":100},{"$f":"Standard!AU205","v":30},130,"RR n.3 2017"]
[{"$f":"Coltura!A204","v":203},{"$f":"Coltura!B204","v":16},{"$f":"Coltura!C204","v":"S16"},"nd",{"$f":"Coltura!D204","v":"Orzo da seme (granella)"},340,150,6,"tq","gran","no",6,87,{"$f":"Standard!E206","v":6.5},{"$f":"Standard!F206","v":125},{"$f":"Standard!AU206","v":40},165,"RR n.3 2017"]
[{"$f":"Coltura!A205","v":204},{"$f":"Coltura!B205","v":17},{"$f":"Coltura!C205","v":"S17"},"nd",{"$f":"Coltura!D205","v":"Pisello proteico da seme (granella)"},50,"nd","nd",null,"gran","no",false,null,{"$f":"Standard!E207","v":"nd"},{"$f":"Standard!F207","v":50},{"$f":"Standard!AU207","v":30},80,"RR n.3 2017"]
[{"$f":"Coltura!A206","v":205},{"$f":"Coltura!B206","v":18},{"$f":"Coltura!C206","v":"S18"},"nd",{"$f":"Coltura!D206","v":"Prezzemolo da seme"},340,"nd","nd",null,"seme","no",false,null,{"$f":"Standard!E208","v":"nd"},{"$f":"Standard!F208","v":100},{"$f":"Standard!AU208","v":20},120,"RR n.3 2017"]
[{"$f":"Coltura!A207","v":206},{"$f":"Coltura!B207","v":19},{"$f":"Coltura!C207","v":"S19"},"nd",{"$f":"Coltura!D207","v":"Ravanello da seme"},340,"nd","nd",null,"seme","no",false,null,{"$f":"Standard!E209","v":"nd"},{"$f":"Standard!F209","v":150},{"$f":"Standard!AU209","v":40},190,"RR n.3 2017"]
[{"$f":"Coltura!A208","v":207},{"$f":"Coltura!B208","v":20},{"$f":"Coltura!C208","v":"S20"},"nd",{"$f":"Coltura!D208","v":"Segale da seme (granella)"},340,120,4.5,"tq","gran","no",4.5,87,{"$f":"Standard!E210","v":4},{"$f":"Standard!F210","v":100},{"$f":"Standard!AU210","v":50},150,"RR n.3 2017"]
[{"$f":"Coltura!A209","v":208},{"$f":"Coltura!B209","v":21},{"$f":"Coltura!C209","v":"S21"},"nd",{"$f":"Coltura!D209","v":"Soia da seme (granella)"},120,30,null,"tq","gran","no",0,86,{"$f":"Standard!E211","v":3.5},{"$f":"Standard!F211","v":0},{"$f":"Standard!AU211","v":120},120,"RR n.3 2017"]
[{"$f":"Coltura!A210","v":209},{"$f":"Coltura!B210","v":22},{"$f":"Coltura!C210","v":"S22"},"nd",{"$f":"Coltura!D210","v":"Triticale da seme (granella)"},340,150,6,"tq","gran","no",6,87,{"$f":"Standard!E212","v":7.5},{"$f":"Standard!F212","v":140},{"$f":"Standard!AU212","v":50},190,"RR n.3 2017"]
[{"$f":"Standard!A213","v":210},{"$f":"Coltura!B211","v":1},{"$f":"Coltura!C211","v":"BL1"},"1° taglio",{"$f":"Standard!C213","v":"Bietola da foglia"},340,"nd","nd","tq","foglie","sì","nd",null,{"$f":"Standard!E213","v":11.5},{"$f":"Standard!F213","v":60},{"$f":"Standard!AU213","v":30},90,"RR n.3 2017"]
[{"$f":"Standard!A214","v":211},{"$f":"Coltura!B211","v":1},{"$f":"Coltura!C211","v":"BL1"},"2° taglio o succ.",{"$f":"Standard!C214","v":"Bietola da foglia"},340,"nd","nd","tq","foglie","sì","nd",null,{"$f":"Standard!E214","v":11.5},{"$f":"Standard!F214","v":30},{"$f":"Standard!AU214","v":30},60,"RR n.3 2017"]
[{"$f":"Standard!A215","v":212},{"$f":"Coltura!B212","v":2},{"$f":"Coltura!C212","v":"BL2"},"1° taglio",{"$f":"Standard!C215","v":"Cicorino"},340,"nd","nd","tq","foglie","sì","nd",null,{"$f":"Standard!E215","v":12},{"$f":"Standard!F215","v":60},{"$f":"Standard!AU215","v":40},100,"RR n.3 2017"]
[{"$f":"Standard!A216","v":213},{"$f":"Coltura!B212","v":2},{"$f":"Coltura!C213","v":"BL3"},"2° taglio o succ.",{"$f":"Standard!C216","v":"Cicorino"},340,"nd","nd","tq","foglie","sì","nd",null,{"$f":"Standard!E216","v":12},{"$f":"Standard!F216","v":40},{"$f":"Standard!AU216","v":40},80,"RR n.3 2017"]
[{"$f":"Standard!A217","v":214},{"$f":"Coltura!B213","v":3},{"$f":"Coltura!C213","v":"BL3"},"1° taglio",{"$f":"Standard!C217","v":"Foglie e steli di Brassica"},340,"nd","nd","tq","foglie","sì","nd",null,{"$f":"Standard!E217","v":10},{"$f":"Standard!F217","v":40},{"$f":"Standard!AU217","v":20},60,"RR n.3 2017"]
[{"$f":"Standard!A218","v":215},{"$f":"Coltura!B213","v":3},{"$f":"Coltura!C213","v":"BL3"},"2° taglio o succ.",{"$f":"Standard!C218","v":"Foglie e steli di Brassica"},340,"nd","nd","tq","foglie","sì","nd",null,{"$f":"Standard!E218","v":10},{"$f":"Standard!F218","v":20},{"$f":"Standard!AU218","v":20},40,"RR n.3 2017"]
[{"$f":"Standard!A219","v":216},{"$f":"Coltura!B214","v":4},{"$f":"Coltura!C214","v":"BL4"},"un ciclo intero",{"$f":"Standard!C219","v":"Lattuga da cespo"},340,"nd","nd","tq","foglie","sì","nd",null,{"$f":"Standard!E219","v":32},{"$f":"Standard!F219","v":110},{"$f":"Standard!AU219","v":30},140,"RR n.3 2017"]
[{"$f":"Standard!A220","v":217},{"$f":"Coltura!B215","v":5},{"$f":"Coltura!C215","v":"BL5"},"1° taglio",{"$f":"Standard!C220","v":"Lattughino 1° taglio"},340,"nd","nd","tq","foglie","sì","nd",null,{"$f":"Standard!E220","v":11.5},{"$f":"Standard!F220","v":25},{"$f":"Standard!AU220","v":20},45,"RR n.3 2017"]
[{"$f":"Standard!A221","v":218},{"$f":"Coltura!B216","v":6},{"$f":"Coltura!C216","v":"BL6"},"2° taglio o succ.",{"$f":"Standard!C221","v":"Lattughino 2° taglio"},340,"nd","nd","tq","foglie","sì","nd",null,{"$f":"Standard!E221","v":11.5},{"$f":"Standard!F221","v":15},{"$f":"Standard!AU221","v":20},35,"RR n.3 2017"]
[{"$f":"Standard!A222","v":219},{"$f":"Coltura!B217","v":7},{"$f":"Coltura!C217","v":"BL7"},"1° taglio",{"$f":"Standard!C222","v":"Rucola 1° taglio"},340,"nd","nd","tq","foglie","sì","nd",null,{"$f":"Standard!E222","v":8.5},{"$f":"Standard!F222","v":40},{"$f":"Standard!AU222","v":20},60,"RR n.3 2017"]
[{"$f":"Standard!A223","v":220},{"$f":"Coltura!B218","v":8},{"$f":"Coltura!C218","v":"BL8"},"2° taglio o succ.",{"$f":"Standard!C223","v":"Rucola 2° taglio"},340,"nd","nd","tq","foglie","sì","nd",null,{"$f":"Standard!E223","v":8.5},{"$f":"Standard!F223","v":15},{"$f":"Standard!AU223","v":20},35,"RR n.3 2017"]
[{"$f":"Standard!A224","v":221},{"$f":"Coltura!B219","v":9},{"$f":"Coltura!C219","v":"BL9"},"1° taglio",{"$f":"Standard!C224","v":"Spinacino 1° taglio"},340,"nd","nd","tq","foglie","sì","nd",null,{"$f":"Standard!E224","v":6},{"$f":"Standard!F224","v":25},{"$f":"Standard!AU224","v":20},45,"RR n.3 2017"]
[{"$f":"Standard!A225","v":222},{"$f":"Coltura!B220","v":10},{"$f":"Coltura!C220","v":"BL10"},"2° taglio o succ.",{"$f":"Standard!C225","v":"Spinacino 2° taglio"},340,"nd","nd","tq","foglie","sì","nd",null,{"$f":"Standard!E225","v":6},{"$f":"Standard!F225","v":15},{"$f":"Standard!AU225","v":20},35,"RR n.3 2017"]
[{"$f":"Standard!A226","v":223},{"$f":"Coltura!B221","v":11},{"$f":"Coltura!C221","v":"BL11"},"un ciclo intero",{"$f":"Standard!C226","v":"Valerianella"},340,"nd","nd","tq","foglie","sì","nd",null,{"$f":"Standard!E226","v":9},{"$f":"Standard!F226","v":40},{"$f":"Standard!AU226","v":20},60,"RR n.3 2017"]
[{"$f":"Standard!A227","v":224},{"$f":"Coltura!B222","v":12},{"$f":"Coltura!C222","v":"BL12"},"un ciclo intero",{"$f":"Standard!C227","v":"baby leaf generica"},340,"nd","nd","tq","foglie","sì","nd",null,{"$f":"Standard!E227","v":10},{"$f":"Standard!F227","v":40},{"$f":"Standard!AU227","v":20},60,"RR n.3 2017"]
[]
[1,{"$f":"(A229+1)","v":2},{"$f":"(B229+1)","v":3},4,5,6,7,{"$f":"(G229+1)","v":8},9,10,11,12,13,14,15,16,17,18]
["ordinato","progressivo di gruppo","ID_Coltura","fase","Coltura attualmente selezionata",null,null,null,null,null,null,null,null,null,null,null,null,"nota"]
[{"$f":"Standard!A233","v":207},{"$f":"Coltura!B225","v":20},{"$f":"Coltura!C225","v":"S20"},{"$f":"Standard!D233","v":"nd"},{"$f":"DGET($A$3:$Q$227,E229,$A$230:$D$231)","v":"Segale da seme (granella)"},120,{"$f":"DGET($A$3:$Q$227,G229,$A$230:$D$231)","v":120},4.5,"tq","gran","no",4.5,87,4,100,50,{"$f":"DGET($A$3:$R$227,Q229,$A$230:$D$231)","v":150},{"$f":"DGET($A$3:$R$227,R229,$A$230:$D$231)","v":"RR n.3 2017"}]
[null,null,null,null,"Mancata o carente inoculazione",{"$f":"IF(Codici!AT2<Coltura!E225,1,0)","v":0}]
[null,null,null,null,null,null,null,null,null,null,null,"Nel Bilancio",null,"ipotesi",null,null,"Ammesso "]
[null,null,null,null,null,null,"fert. Prec.",null,null,null,null,"fert. Prec.",null,"resa",null,null,"da bilancio","dalla scheda"]
[null,null,"ID_Pre",null,"Precessione",null,"kg/ha",null,null,null,null,"kg/ha",null,"t",null,null,"kg/ha","kg/ha"]
[null,null,{"$f":"E!A27","v":2},null,{"$f":"E!B28","v":"Cereale autunno-vern. Paglia asportata"},null,{"$f":"IF(OR(C236=8,C236=9),60,IF(OR(C236=15,C236=16),40,0))","v":0},null,null,null,null,{"$f":"E!C28","v":-10},null,{"$f":"Codici!M2","v":4},null,null,{"$f":"Bilancio!H33","v":120.03},{"$f":"IF(C_tempo!I22=\"sì\",Scheda_N!D39,Scheda_N!H32)","v":115}]
[]
[null,null,"Irrigazione",null,null,null,null,null,null,null,null,null,"Note:",null,null,null,null,null,"rif. Al MAS","rif. Scheda"]
[null,null,{"$f":"Codici!AW2","v":true},null,null,null,null,null,null,null,null,null,"x  il MAS","La resa ipotizzata è più alta di quella di riferimento del MAS",null,null,null,null,{"$f":"IF(G248=\"nd\",FALSE,IF(AND($N$236>$L$244,$I$244=TRUE),TRUE,FALSE))","v":false}]
[null,null,null,null,"Coltura non  diversificata (irriguo/asciutto)",null,null,null,null,null,null,null,"x scheda","La resa ipotizzata è più alta di quella di riferimento DPI",null,null,null,null,null,{"$f":"IF(N236>Standard!$AH$237,TRUE,FALSE)","v":false}]
[null,null,null,null,{"$f":"IF(OR(C231=\"E28\",C231=\"E29\",C231=\"E32\"),FALSE,TRUE)","v":true},null,null,null,null,null,null,null," x scheda",{"$f":"IF(OR(G248=\"nd\",C_tempo!E22<1),\" \",IF(AND(Scheda_N!H32>$G$248,$I$244=TRUE),\"ATTENZIONE! L'apporto di N non può superare il limite MAS\",\" \"))","v":" "},null,null,null,null,{"$f":"IF(G248=\"nd\",FALSE,IF(AND(R236>$G$248,$I$244=TRUE),TRUE,FALSE))","v":false}]
[null,null,null,null,null,null,"Riduzione in asciutto","Riferimento resa in base al regime irriguo","ZVN",null,null,"Riferimento resa in asciutto"," x scheda",{"$f":"IF(AND(S241=TRUE,S239=TRUE),\"Per poter superare il MAS bisogna documentare la resa elevata\",\" \")","v":" "},null,null,null,null,{"$f":"CONCATENATE(\"> di \",$H$244,\" t/ha\")","v":"> di 4,5 t/ha"}]
[null,null,null,null,null,null,"kg/ha","t",null,null,null,"t"," x bilancio",{"$f":"IF(G248=\"nd\",\" \",IF(AND($Q$236>$G$248,$I$244=TRUE),\"ATTENZIONE! L'apporto di N non può superare il limite MAS\",\" \"))","v":"ATTENZIONE! L'apporto di N non può superare il limite MAS"},null,null,null,null,{"$f":"IF(G248=\"nd\",FALSE,IF(AND($Q$236>$G$248,$I$244=TRUE),TRUE,FALSE))","v":true}]
[null,null,null,null,null,null,{"$f":"IF(AND($C$239=FALSE,$K$231=\"sì\"),70,0)","v":0},{"$f":"IF(AND($C$239=FALSE,$K$231=\"sì\"),(H231*0.8),H231)","v":4.5},{"$f":"Codici!AX2","v":true},null,null,{"$f":"IF(AND($C$239=FALSE,$K$231=\"sì\"),(L231*0.8),L231)","v":4.5}," x bilancio",{"$f":"IF(AND(S243=TRUE,S239=TRUE),\"Per poter superare il MAS bisogna documentare la resa elevata\",\" \")","v":" "},null,null,null,null,{"$f":"CONCATENATE(\"> di \",$L$245,\" t/ha\")","v":"> di 4,5 t/ha"}]
[null,null,null,null,null,null,null,null,null,null,"arrotonda",{"$f":"ROUND(L244,1)","v":4.5}]
[null,null,null,null,null,null,"MAS"]
[null,null,null,null,null,null,"corretto"]
[null,null,null,null,null,null,{"$f":"IF(G231=\"nd\",\"nd\",(G231-G236-G244))","v":120}]

{"sheet":"Valori da riportare","index":7,"n_rows":7,"n_cols":7,"rows_kept":7,"cut":false,"hidden":true,"merged":[[0,1,0,6]]}
[null,"Valori da riportare nella scheda BILANCIO"]
[null,"Valori intermedi",null,null,{"$f":"IF(C_tempo!A22=1,0,IF(C_tempo!A22=2,Standard!BI233,IF(C_tempo!A22=3,Standard!BJ237,(Bilancio!$H$31*C_tempo!E22))))","v":120.03},{"$f":"IF(AND(C_tempo!A22=2,Gri_P!A10>2),Standard!BL233,IF(AND(C_tempo!A22=3,Gri_P!A10>2),Standard!BM237,Bilancio!$I$31))","v":-62.683999999999983},{"$f":"IF(AND(C_tempo!A22=2,Gri_K!H18>2),Standard!BO233,IF(AND(C_tempo!A22=3,Gri_K!H18>2),Standard!BP237,Bilancio!$J$31))","v":-578.39445599999988}]
[null,"Non Negativo",null,null,{"$f":"IF(E2>0,E2,0)","v":120.03},{"$f":"IF(F2>0,F2,0)","v":0},0]
[null,"Limite predefinito",null,null,{"$f":"Coltura!H225","v":340}]
[null,"Limite azoto fissazione carente",null,null,{"$f":"MAS!F231","v":120}]
[null,"Limite da considerare",null,null,{"$f":"IF(MAS!F232=1,'Valori da riportare'!E5,'Valori da riportare'!E4)","v":340},250,300]
[null,"Valore da riportare",null,null,{"$f":"IF(E3<E6,E3,E6)","v":120.03},{"$f":"IF(F3<F6,F3,F6)","v":0},0]

{"sheet":"Bilancio","index":8,"n_rows":38,"n_cols":11,"rows_kept":38,"cut":false,"hidden":false,"merged":[[8,6,8,10],[9,6,9,10],[5,2,5,3],[3,2,3,3],[9,1,10,1],[7,3,7,5]]}
[null,"Piano di fertilizzazione"]
[{"$f":"Metodo!D3","v":"sì"},{"$f":"IF(Metodo!D3=\"no\",\"Metodo del Bilancio NON PREVISTO per questa coltura\",\"Quantitativi di elementi nutritivi da apportare calcolati col METODO DEL BILANCIO\")","v":"Quantitativi di elementi nutritivi da apportare calcolati col METODO DEL BILANCIO"}]
[]
[null,"Azienda",{"$f":"Inserimento!B5","v":"Pinco Pallino"},null,null,null,null,"Zona ZVN",null,"Area",{"$f":"Inserimento!N5","v":"A"}]
[]
[null,"Appezz.",{"$f":"Inserimento!Q5","v":1},null,null,null,null,{"$f":"Codici!AX2","v":true},null,"Anno",{"$f":"Inserimento!T5","v":2019}]
[]
[null,null,"Coltura",{"$f":"(Coltura!D225)","v":"Segale da seme (granella)"},null,null,null,"Resa  annua prevista",null,"t/ha",{"$f":"Codici!M2","v":4}]
[null,null,"Fase/ciclo",{"$f":"C_tempo!B22","v":"Autunno-vernina <150 gg"},null,null,{"$f":"IF(MAS!S239=TRUE,MAS!N239,\" \")","v":" "}]
[null,"Modalità di coltivazione:",null,null,null,null,{"$f":"IF(MAS!T240=TRUE,MAS!N240,\" \")","v":" "}]
[null,null,{"$f":"Coltura!M22","v":"pieno campo"},{"$f":"IF(MAS!F232=1,\"Azoto fissazione carente\",\" \")","v":" "}]
[null,null,null,null,null,null,null,null,"kg/ha"]
[null,null,null,null,null,null,null,"N","P2O5","K2O**"]
[null,null,null,"NECESSITA'"]
[null,null,"A)","Fabbisogno della coltura",null,null,null,{"$f":"A!D231","v":111.19999999999999},{"$f":"A!E231","v":28},{"$f":"A!F231","v":20}]
[null,null,"C)","Perdite per lisciviazione",null,null,null,{"$f":"'C&D'!C22+'C&D'!C24+'C&D'!C32","v":23.16},null,{"$f":"Gri_K!O21","v":10}]
[null,null,"- Ca)","N \"pronto\" perso nel periodo autunno invernale",null,null,null,{"$f":"'C&D'!C22","v":16.329599999999999}]
[null,null,"- Cb)","N perso all'uscita dall'inverno",null,null,null,{"$f":"('C&D'!C24+'C&D'!C32)","v":6.8304000000000018}]
[null,null,"D)","Immobilizzazioni e dispersioni (*)",null,null,null,{"$f":"'C&D'!G23","v":23.770000000000003}]
[null,null,"B1)","Arricchimernti",null,null,null,null,{"$f":"Gri_P!I14","v":0},{"$f":"Gri_K!F29","v":0}]
[null,null,"A2)","Anticipazioni anni futuri",null,null,null,null,{"$f":"IF(AND(C_tempo!H22=\"sì\",Codici!K2=TRUE),Gri_P!H22,0)","v":0},{"$f":"IF(AND(C_tempo!H22=\"sì\",Codici!K2=TRUE),Gri_K!G26,0)","v":0}]
[null,"Totale necessità",null,null,null,null,null,{"$f":"SUM(H15,H16,H19:H21)","v":158.13},{"$f":"SUM(I15:I21)","v":28},{"$f":"SUM(J15:J21)","v":30}]
[]
[null,null,null,"DISPONIBILITA'"]
[null,null,"B)","Fertilità del suolo",null,null,null,{"$f":"B!P19","v":30.6},{"$f":"Gri_P!I16","v":90.683999999999983},{"$f":"IF(Gri_K!K36=\"Sì\",0,Gri_K!F31)","v":608.39445599999988}]
[null,null,"E)","Precessione",null,null,null,{"$f":"E!F28","v":0}]
[null,null,"F)","Fertilità organica residua",null,null,null,{"$f":"F!M14","v":0}]
[null,null,"G)","Apporti naturali",null,null,null,{"$f":"G!D20","v":7.5}]
[null,"Totale disponibilità",null,null,null,null,null,{"$f":"SUM(H25:H28)","v":38.1},{"$f":"SUM(I25:I28)","v":90.683999999999983},{"$f":"SUM(J25:J28)","v":608.39445599999988}]
[]
[null,"Bisogno calcolato",null,null,null,null,null,{"$f":"(H22-H29)","v":120.03},{"$f":"(I22-I29)","v":-62.683999999999983},{"$f":"(J22-J29)","v":-578.39445599999988}]
[]
[null,"Apporto ammesso col \"Bilancio\"",null,null,{"$f":"IF(Standard!BR233=\"sì\",Standard!BT233,\"\")","v":""},null,null,{"$f":"'Valori da riportare'!E7","v":120.03},{"$f":"'Valori da riportare'!F7","v":0},{"$f":"'Valori da riportare'!G7","v":0}]
[]
[null,{"$f":"MAS!N243","v":"ATTENZIONE! L'apporto di N non può superare il limite MAS"},null,null,null,null,null,{"$f":"MAS!G248","v":120},{"$f":"IF(MAS!S243=TRUE,MAS!R231,\" \")","v":"RR n.3 2017"}]
[null,{"$f":"MAS!N244","v":" "},null,null,{"$f":"MAS!S244","v":"> di 4,5 t/ha"}]
[" *)"," comprensive di eventuali immobilizzazioni della precessione"]
["**)",{"$f":"IF(Gri_K!$K$36=\"sì\",\" dotazione di K corretta in funzione del rapporto Mg/K e della CSC\",\" \")","v":" "}]

{"sheet":"Scheda_N","index":9,"n_rows":40,"n_cols":13,"rows_kept":40,"cut":false,"hidden":false,"merged":[[37,6,37,8],[5,6,5,8],[3,6,3,9]]}
[]
[null,"Piano di fertilizzazione; metodo: Scheda a dose Standard",null,null,null,null,null,null,null,null,null,"anno",{"$f":"Inserimento!T5","v":2019}]
[]
[null,"Azienda",{"$f":"Inserimento!B5","v":"Pinco Pallino"},null,null,"Coltura",{"$f":"(Coltura!D225)","v":"Segale da seme (granella)"},null,null,null,null,"ZVN",{"$f":"Codici!AX2","v":true}]
[]
[null,"Appezz.",{"$f":"Inserimento!Q5","v":1},null,null,"Fase",{"$f":"C_tempo!B22","v":"Autunno-vernina <150 gg"},null,null,null,null,"Area",{"$f":"Inserimento!N5","v":"A"}]
[]
[null,null,"Decrementi (kg/ha)",null,null,null,"AZOTO",null,null,null,"Incrementi (kg/ha)","max",{"$f":"(Standard!AU233+M30)","v":50}]
[null,null,"fattore","condiz.",null,null,{"$f":"IF(Standard!$BR$233=\"sì\",\"Dose Standard base kg/ha\",\"\")","v":""},{"$f":"IF(Standard!$BR$233=\"sì\",Standard!BS233,\"\")","v":""},null,null,"fattore","condiz."]
[null,null,{"$f":"CONCATENATE(Standard!$O$3,\" \",Standard!$O$233,\" t/ha\")","v":"Resa bassa inferiore a 3 t/ha"},{"$f":"IF(Standard!O233=\"nd\",\"nd\",IF(Codici!$M$2<Standard!$O$233,TRUE,FALSE))","v":false},{"$f":"IF(D10=TRUE,Standard!P233,0)","v":0},null,{"$f":"IF(Standard!$BR$233=\"sì\",\"numero tagli programmati\",\"\")","v":""},{"$f":"IF(Standard!$BR$233=\"sì\",Codici!BA2,\"\")","v":""},null,null,{"$f":"CONCATENATE(Standard!$AH$3,\" \",Standard!$AH$233,\" t/ha\")","v":"Resa alta superiore a 5 t/ha"},{"$f":"IF(Standard!AH233=\"nd\",\"nd\",IF(Codici!$M$2>Standard!$AH$233,TRUE,FALSE))","v":false},{"$f":"IF(L10=TRUE,Standard!AI$233,0)","v":0}]
[]
[null,null,{"$f":"IF(Standard!Q233>0,Standard!Q3,\" \")","v":"Ammendante nell'anno precedente"},false,{"$f":"IF(D12=TRUE,Standard!Q233,0)","v":0},null,{"$f":"IF(Standard!$BR$233=\"sì\",\"dose per ogni taglio successivo\",\"\")","v":""},{"$f":"IF(Standard!$BR$233=\"sì\",Standard!BU233,\"\")","v":""},null,null,{"$f":"IF(Standard!AJ233>0,Standard!$AJ$3,\" \")","v":"Tenore SO nel suolo basso"},{"$f":"IF(OR(B!$E$19=\"molto bassa\",B!$E$19=\"bassa\"),TRUE,FALSE)","v":true},{"$f":"IF(L12=TRUE,Standard!AJ$233,0)","v":15}]
[]
[null,null,{"$f":"IF(Standard!R233>0,Standard!R3,\" \")","v":" "},false,{"$f":"IF(D14=TRUE,Standard!R233,0)","v":0},null,{"$f":"IF(Standard!$BR$233=\"sì\",\"Dose Standard complessiva  kg/ha\",\"Dose Standard base kg/ha\")","v":"Dose Standard base kg/ha"},{"$f":"IF(OR(M39=1,M39=15,M39=16),\"Vedi Bilancio\",IF(M38=0,0,IF(M38<1,\"Vedi dose fase allevamento\",IF(Standard!F233=\"nd\",\"nd\",Standard!F233))))","v":100},null,null,{"$f":"IF(Standard!AK233>0,Standard!AK3,\" \")","v":" "},true,{"$f":"IF(L14=TRUE,Standard!AK233,0)","v":0}]
[null,null,{"$f":"IF(AND(D14=TRUE,L14=TRUE),\"selezione incongruente !\", \" \")","v":" "}]
[null,null,null,null,null,null,{"$f":"IF(AND(L16=TRUE,OR(D22=TRUE,D24=TRUE)),\"selezione incongruente!\",\" \")","v":" "},null,null,null,{"$f":"IF(Standard!AN233>0,Standard!AN3,\" \")","v":"Ristoppio o interramento paglie"},false,{"$f":"IF(L16=TRUE,Standard!AN233,0)","v":0}]
[]
[null,null,{"$f":"IF(Standard!S233>0,Standard!S3,\" \")","v":"Tenore SO nel suolo elevato"},{"$f":"IF(B!E19=\"elevata\",TRUE,FALSE)","v":false},{"$f":"IF(D18=TRUE,Standard!S233,0)","v":0},null,null,null,null,null,{"$f":"IF(Standard!AM233>0,(Standard!AM3),\" \")","v":"Lisciviazione x surplus pluviometrico"},{"$f":"'C&D'!D35","v":false},{"$f":"IF(L18=TRUE,Standard!AM233,0)","v":0}]
[]
[null,null,{"$f":"IF(Standard!T233>0,Standard!T3,\" \")","v":"Tenore SO nel suolo molto elevato (>4%)"},{"$f":"IF(Codici!Z2>4,TRUE,FALSE)","v":false},{"$f":"IF(D20=TRUE,Standard!T233,0)","v":0},null,null,null,null,null,{"$f":"IF(Standard!AR233>0,Standard!AR3,\" \")","v":" "},false,{"$f":"IF(L20=TRUE,Standard!AR233,0)","v":0}]
[]
[null,null,{"$f":"IF(Standard!U233>0,Standard!U3,\" \")","v":"Dopo medica o prato > 5 anni"},false,{"$f":"IF(D22=TRUE,Standard!U233,0)","v":0},null,{"$f":"IF(AND(D22=TRUE,D24=TRUE),\"selezione incongruente!\",\" \")","v":" "},null,null,null,{"$f":"IF(Standard!AP233>0,Standard!AP3,\" \")","v":" "},false,{"$f":"IF(L22=TRUE,Standard!AP233,0)","v":0}]
[]
[null,null,{"$f":"IF(Standard!V233>0,Standard!V3,\" \")","v":"Dopo una  leguminosa"},false,{"$f":"IF(D24=TRUE,Standard!V233,0)","v":0},null,null,null,null,null,{"$f":"IF(Standard!AQ233>0,Standard!AQ3,\" \")","v":" "},false,{"$f":"IF(L24=TRUE,Standard!AQ233,0)","v":0}]
[]
[null,null,{"$f":"IF(Standard!W233>0,Standard!W3,\" \")","v":" "},false,{"$f":"IF(D26=TRUE,Standard!AA233,0)","v":0},null,null,null,null,null,{"$f":"IF(Standard!AS233>0,Standard!AS3,\" \")","v":" "},false,{"$f":"IF(L26=TRUE,Standard!AS233,0)","v":0}]
[]
[null,null,null,null,null,null,null,null,null,null,{"$f":"IF(Standard!AO233>0,Standard!AO3,\" \")","v":" "},false,{"$f":"IF(L28=TRUE,Standard!AO233,0)","v":0}]
[]
[null,null,null,null,null,null,null,null,null,null,{"$f":"IF(Standard!AT233>0,Standard!AT3,\" \")","v":" "},false,{"$f":"IF(L30=TRUE,Standard!AT233,0)","v":0}]
[]
[null,null,"totale riduzioni",null,{"$f":"SUM(E10:E30)","v":0},null,"Apporto ricalcolato",{"$f":"IF(H14=\"Vedi Bilancio\",H39,IF(M38=0,0,IF(M40=\"sì\",\"nessun ricalcolo \",IF((H14-E32+M32)<0,0,IF(OR((H14-E32+M32)<(H14+M8),(H14-E32+M32)=(H14+M8)),(H14-E32+M32),(H14+M8))))))","v":115},null,null,"totale incrementi",null,{"$f":"SUM(M10:M30)","v":15}]
[]
[]
[null,{"$f":"MAS!N241","v":" "},null,null,null,null,{"$f":"MAS!G248","v":120}]
[null,{"$f":"MAS!N242","v":" "},null,null,{"$f":"MAS!S242","v":"> di 4,5 t/ha"}]
[]
[null,{"$f":"IF(M40=\"sì\",\"Concimazione azoto in allevamento:\",\" \")","v":" "},null,null,null,null,"Riferimenti al metodo del bilancio",null,null,null,null,"% N =",{"$f":"C_tempo!E22","v":1}]
[null,null,{"$f":"IF($M$39=2,\"1 anno \",IF(M39=3,\"2 anno\",\" \"))","v":" "},{"$f":"IF(M40=\"no\",\" \",IF(M39=2,Standard!BI233,Standard!BJ237))","v":" "},"kg/ha N",null,"ammesso",{"$f":"Bilancio!H33","v":120.03},null,null,null,"ID:Cat",{"$f":"C_tempo!A22","v":13}]
[null,null,null,null,null,null,"calcolato",{"$f":"Bilancio!H31","v":120.03},null,null,null,"allev. ",{"$f":"C_tempo!I22","v":"no"}]

{"sheet":"Scheda_PK","index":10,"n_rows":38,"n_cols":16,"rows_kept":38,"cut":false,"hidden":false,"merged":[[37,1,37,9],[26,6,26,7],[25,6,25,7]]}
[null,"Piano di fertilizzazione; metodo: Scheda a dose Standard",null,null,null,null,null,null,null,null,null,"anno",{"$f":"Inserimento!T5","v":2019}]
[]
[null,"Azienda",{"$f":"Inserimento!B5","v":"Pinco Pallino"},null,"Coltura",{"$f":"Coltura!D225","v":"Segale da seme (granella)"},null,null,null,null,null,"ZVN",{"$f":"Codici!AX2","v":true},null,"Allev.",{"$f":"C_tempo!I22","v":"no"}]
[]
[null,"Appezz.",{"$f":"Inserimento!Q5","v":1},null,"Fase",{"$f":"C_tempo!B22","v":"Autunno-vernina <150 gg"},null,null,null,null,null,"Area",{"$f":"Inserimento!N5","v":"A"},null,"ID_Fa_D",{"$f":"C_tempo!A22","v":13}]
[]
[null,null,"Decrementi (kg/ha)",null,null,null,null,null,null,null,"Incrementi (kg/ha)"]
[null,null,"fattore","condiz.",null,null,null,null,null,null,"fattore","condiz."]
[null,null,{"$f":"CONCATENATE(Standard!$O$3,\" \",Standard!$O$233,\" t/ha\")","v":"Resa bassa inferiore a 3 t/ha"},{"$f":"IF(Standard!O233=\"nd\",\"nd\",IF(Codici!$M$2<Standard!$O$233,TRUE,FALSE))","v":false},{"$f":"IF(D9=TRUE,Standard!X233,0)","v":0},null,"FOSFORO",null,null,null,{"$f":"CONCATENATE(Standard!$AH$3,\" \",Standard!$AH$233,\" t/ha\")","v":"Resa alta superiore a 5 t/ha"},{"$f":"IF(Standard!AH233=\"nd\",\"nd\",IF(Codici!$M$2>Standard!$AH$233,TRUE,FALSE))","v":false},{"$f":"IF(L9=TRUE,Standard!AV$233,0)","v":0},null,"% P2O5",{"$f":"C_tempo!E22","v":1}]
[null,null,null,null,null,null,{"$f":"CONCATENATE(\"con tenore P nel suolo \",Gri_P!G10)","v":"con tenore P nel suolo molto alto"}]
[null,null,{"$f":"IF(Standard!Y233>0,Standard!Y3,\" \")","v":" "},false,{"$f":"IF(D11=TRUE,Standard!Y233,0)","v":0},null,"Dose standard  base kg/ha di P2O5",{"$f":"IF(OR(P5=1,P5=15,P5=16),\"Vedi Bilancio\",IF(P9<1,\"Vedi dose allevamento\",IF(Standard!F233=\"nd\",\"nd\",IF(Gri_P!G10=\"normale\",Standard!G233,IF(Gri_P!G10=\"molto alto\",Standard!I233,IF(Gri_P!G10=\"molto scarso\",Standard!J233,Standard!H233))))))","v":0},null,null,{"$f":"IF(Standard!AY233>0,Standard!AY3,\" \")","v":" "},false,{"$f":"IF(L11=TRUE,Standard!AZ233,0)","v":0}]
[]
[null,null,{"$f":"IF(Standard!AA233>0,Standard!AA3,\" \")","v":" "},false,{"$f":"IF(D13=TRUE,Standard!AA233,0)","v":0},null,null,null,null,null,{"$f":"IF(Standard!AZ233>0,Standard!AZ3,\" \")","v":" "},{"$f":"IF(Calcare!D26=\"Molto elevato\",TRUE,FALSE)","v":true},{"$f":"IF(L13=TRUE,Standard!AY233,0)","v":0}]
[]
[null,null,{"$f":"IF(Standard!AB233>0,Standard!AB3,\" \")","v":" "},false,{"$f":"IF(D15=TRUE,Standard!AB233,0)","v":0},null,null,null,null,null,{"$f":"IF(Standard!AX233>0,Standard!AX3,\" \")","v":" "},false,{"$f":"IF(L15=TRUE,Standard!AX233,0)","v":0}]
[]
[null,null,null,null,null,null,null,null,null,null,{"$f":"IF(Standard!BA233>0,Standard!BA3,\" \")","v":" "},false,{"$f":"IF(L17=TRUE,Standard!AZ233,0)","v":0}]
[]
[null,null,null,null,null,null,null,null,null,null,{"$f":"IF(Standard!AW233>0,Standard!AW3,\" \")","v":" "},{"$f":"IF(OR(B!E19=\"bassa\",B!E19=\"molto bassa\"),TRUE,FALSE)","v":true},{"$f":"IF(L19=TRUE,Standard!AW233,0)","v":0}]
[]
[null,null,"totale riduzioni",null,{"$f":"SUM(E9:E17)","v":0},null,null,null,null,null,"totale incrementi",null,{"$f":"SUM(M9:M19)","v":0},null,"Riferimenti al Bilancio"]
[null,null,null,null,null,null,"Dose ricalcolata",{"$f":"IF(H11=\"Vedi Bilancio\",P22,IF(P3=\"sì\",\" \",IF((H11+M21-E21)>0,(H11+M21-E21),0)))","v":0},null,null,null,null,null,null,"ammesso",{"$f":"Bilancio!I33","v":0}]
[null,null,null,null,null,null,null,null,null,null,null,null,null,null,"calcolato",{"$f":"Bilancio!I31","v":-62.683999999999983}]
[null,null,{"$f":"IF(P$3=\"sì\",\"Concimazione in allevamento\",\" \")","v":" "},null,{"$f":"IF($P$5=2,\"1 anno \",IF(P5=3,\"2 anno\",\" \"))","v":" "},null,{"$f":"IF(P3=\"no\",\" \",IF(P5=2,Standard!BL233,Standard!BM237))","v":" "}]
[]
[null,null,{"$f":"CONCATENATE(Standard!$O$3,\" \",Standard!$O$233,\" t/ha\")","v":"Resa bassa inferiore a 3 t/ha"},{"$f":"IF(Standard!O233=\"nd\",\"nd\",IF(Codici!$M$2<Standard!$O$233,TRUE,FALSE))","v":false},{"$f":"IF(D26=TRUE,Standard!AC233,0)","v":0},null,"POTASSIO",null,null,null,{"$f":"CONCATENATE(Standard!$AH$3,\" \",Standard!$AH$233,\" t/ha\")","v":"Resa alta superiore a 5 t/ha"},{"$f":"IF(Standard!AH233=\"nd\",\"nd\",IF(Codici!$M$2>Standard!$AH$233,TRUE,FALSE))","v":false},{"$f":"IF(L26=TRUE,Standard!BC$233,0)","v":0},null,"% K2O",{"$f":"C_tempo!G22","v":1}]
[null,null,null,null,null,null,{"$f":"CONCATENATE(\"con dotazione di  K nel suolo \",Gri_K!K38)","v":"con dotazione di  K nel suolo elevata"}]
[null,null,{"$f":"IF(Standard!AD233>0,Standard!AD3,\" \")","v":" "},false,{"$f":"IF(D28=TRUE,Standard!AD233,0)","v":0},null,{"$f":"IF(Standard!$BR$233=\"sì\",\"dose standard base kg/ha\",\"\")","v":""},{"$f":"IF(Standard!$BR$233=\"no\",\"\",IF(Gri_K!K38=\"media\",Standard!BW233,IF(Gri_K!K38=\"elevata\",Standard!BY233,Standard!BX233)))","v":""},null,null,{"$f":"IF(Standard!BD233>0,Standard!BD3,\" \")","v":" "},true,{"$f":"IF(L28=TRUE,Standard!BD233,0)","v":0}]
[]
[null,null,{"$f":"IF(Standard!AG233>0,Standard!AG3,\" \")","v":"Si prevede l'interramento della paglia"},false,{"$f":"IF(D30=TRUE,Standard!AG233,0)","v":0},null,{"$f":"IF(Standard!$BR$233=\"sì\",\"numero tagli programmati\",\"\")","v":""},{"$f":"IF(Standard!$BR$233=\"sì\",Codici!BA2,\"\")","v":""},null,null,{"$f":"IF(Standard!BF233>0,Standard!BF3,\" \")","v":" "},false,{"$f":"IF(L30=TRUE,Standard!BF233,0)","v":0}]
[]
[null,null,{"$f":"IF(Standard!AF233>0,Standard!AF3,\" \")","v":" "},false,{"$f":"IF(D32=TRUE,Standard!AE233,0)","v":0},null,{"$f":"IF(Standard!$BR$233=\"sì\",\"dose per ogni taglio successivo\",\"\")","v":""},{"$f":"IF(Standard!$BR$233=\"no\",\"\",IF(Gri_K!K38=\"media\",Standard!CA233,IF(Gri_K!K38=\"elevata\",Standard!CC233,Standard!CB233)))","v":""},null,null,{"$f":"IF(Standard!BG233>0,Standard!BG3,\" \")","v":" "},true,{"$f":"IF(L32=TRUE,Standard!BG233,0)","v":0}]
[]
[null,null,"totale riduzioni",null,{"$f":"SUM(E26:E32)","v":0},null,{"$f":"IF(Standard!$BR$233=\"sì\",\"Dose Standard complessiva kg/ha\",\"Dose Standard kg/ha\")","v":"Dose Standard kg/ha"},{"$f":"IF(OR(P5=1,P5=15,P5=16),\"Vedi Bilancio\",IF(P26<1,\"vedi dose allevamento\",IF(Standard!F233=\"nd\",\"nd\",IF(Gri_K!K38=\"media\",Standard!K233,IF(Gri_K!K38=\"elevata\",Standard!M233,IF(Gri_K!K38=\"molto bassa\",Standard!N233,Standard!L233))))))","v":0},null,null,"totale incrementi",null,{"$f":"SUM(M26:M32)","v":0},null,"Riferimenti al Bilancio"]
[null,null,null,null,null,null,null,null,null,null,null,null,null,null,"ammesso",{"$f":"Bilancio!J33","v":0}]
[null,null,null,null,null,null,"Dose ricalcolata",{"$f":"IF(H34=\"Vedi Bilancio\",P35,IF(P26=0.2,Standard!BO233,IF(P26=0.4,Standard!BP233,IF(P26<1,\" \",IF((H34+M34-E34)>0,(H34+M34-E34),0)))))","v":0},null,null,null,null,null,null,"calcolato",{"$f":"Bilancio!J31","v":-578.39445599999988}]
[null,null,{"$f":"IF(P$3=\"sì\",\"Concimazione in allevamento\",\" \")","v":" "},{"$f":"IF($P$5=2,\"1 anno \",IF(P5=3,\"2 anno\",\" \"))","v":" "},null,null,{"$f":"IF(P3=\"no\",\" \",IF(P5=2,Standard!BO233,Standard!BP237))","v":" "}]
[null,{"$f":"IF(Gri_K!K36=\"Sì\",\"La dotazione di K è stata corretta in relazione al rapporto Mg/K e alla CSC\",\" \")","v":" "}]

{"sheet":"Distribuz","index":11,"n_rows":39,"n_cols":29,"rows_kept":39,"cut":false,"hidden":false,"merged":[[32,1,32,4],[26,1,26,4],[28,1,28,4],[30,1,30,4],[1,25,1,28]]}
["Predisposizione del Piano di distribuzione dei fertilizzanti",null,null,null,null,null,null,null,null,null,null,null,null,null,null,null,null,null,null,null,null,null,null,null,null,"N","P2O5","K2O","SO"]
["Coltura:",null,{"$f":"Coltura!D225","v":"Segale da seme (granella)"},null,null,null,null,null,"Fase",{"$f":"Cicli_Fase!F31","v":"Autunno-vernina <150 gg"},null,null,null,null,null,null,null,"Metodo selezionato",null,null,{"$f":"Metodo!C8","v":"Bilancio "},null,"anno",{"$f":"Inserimento!T5","v":2019},null,"Apporti ammessi"]
[]
[null,"Fertilizz. Organico",null,null,null,null,null,"titoli kg/t",null,null,null,"Quantità",null,"N campo kg",null,null,null,null,"Epoca e modalità di distribuzione",null,null,null,null,"Efficienza",null,{"$f":"IF(Codici!$E$2=1,Bilancio!$H33,IF(AND(Codici!$E$2=2,OR(Cicli_Fase!$F$30=2,Cicli_Fase!$F$30=3)),Scheda_N!D39,Scheda_N!H32))","v":120.03},{"$f":"IF(Codici!$E$2=1,Bilancio!I33,IF(AND(Codici!$E$2=2,OR(Cicli_Fase!$F$30=2,Cicli_Fase!$F$30=3)),Scheda_PK!$G24,Scheda_PK!$H22))","v":0},{"$f":"IF(Codici!$E$2=1,Bilancio!J33,IF(AND(Codici!$E$2=2,OR(Cicli_Fase!$F$30=2,Cicli_Fase!$F$30=3)),Scheda_PK!$G37,Scheda_PK!$H36))","v":0},{"$f":"SO!F9","v":13}]
[null,"nelle celle color arancio i titoli indicativi",null,null,null,null,"N","P2O5","K2O","ss %",null,"t/ha",null,"Org.","Zootec.",null,"Anno",null,null,null,null,null,null,"%",null,"Quantità utili per la coltura"]
[]
[null,null,null,null,null,null,null,null,null,null,null,null,null,{"$f":"IF(Fert_org!E27>1,(G7*L7),0)","v":0},{"$f":"IF(V8=TRUE,(N7*U8)/100,N7)","v":0},null,null,null,null,null,null,null,null,{"$f":"'Apporti al terreno'!I3","v":40},null,{"$f":"'Apporti al terreno'!M5","v":0},{"$f":"'Apporti al terreno'!P5","v":0},{"$f":"'Apporti al terreno'!S5","v":0},{"$f":"'Apporti al terreno'!U4","v":0}]
[null,null,null,null,null,null,{"$f":"Fert_org!K27","v":5},{"$f":"Fert_org!N27","v":2.4},{"$f":"Fert_org!Q27","v":7},{"$f":"Fert_org!H27","v":25},null,null,null,null,null,null,null,{"$f":"IF(Fert_org!$R27=\"no\",\"indica la % di N zootec..\",\" \")","v":" "},null,null,10,{"$f":"IF(Fert_org!$R27=\"no\",TRUE,FALSE)","v":false}]
[]
[null,null,null,null,null,null,null,null,null,null,null,20,null,{"$f":"IF(Fert_org!E29>1,(G10*L10),0)","v":0},{"$f":"IF(V11=TRUE,(N10*U11)/100,N10)","v":0},null,null,null,null,null,null,null,null,{"$f":"'Apporti al terreno'!I6","v":39.1},null,{"$f":"'Apporti al terreno'!M8","v":0},{"$f":"'Apporti al terreno'!P8","v":0},{"$f":"'Apporti al terreno'!S8","v":0},{"$f":"'Apporti al terreno'!U7","v":0}]
[null,null,null,null,null,null,{"$f":"Fert_org!K29","v":3.85},{"$f":"Fert_org!N29","v":2.8499999999999996},{"$f":"Fert_org!Q29","v":3.8},{"$f":"Fert_org!H29","v":8.5},null,null,null,null,null,null,null,{"$f":"IF(Fert_org!$R29=\"no\",\"indica la % di N zootec..\",\" \")","v":" "},null,null,null,{"$f":"IF(Fert_org!$R29=\"no\",TRUE,FALSE)","v":false}]
[]
[null,null,null,null,null,null,null,null,null,null,null,null,null,{"$f":"IF(Fert_org!E31>1,(G13*L13),0)","v":0},{"$f":"IF(V14=TRUE,(N13*U14)/100,N13)","v":0},null,null,null,null,null,null,null,null,{"$f":"'Apporti al terreno'!I9","v":0},null,{"$f":"'Apporti al terreno'!M11","v":0},{"$f":"'Apporti al terreno'!P11","v":0},{"$f":"'Apporti al terreno'!S11","v":0},{"$f":"'Apporti al terreno'!U10","v":0}]
[null,null,null,null,null,null,{"$f":"Fert_org!K31","v":0},{"$f":"Fert_org!N31","v":0},{"$f":"Fert_org!Q31","v":0},{"$f":"Fert_org!H31","v":0},null,null,null,null,null,null,null,{"$f":"IF(Fert_org!$R31=\"no\",\"indica la % di N zootec..\",\" \")","v":" "},null,null,null,{"$f":"IF(Fert_org!$R31=\"no\",TRUE,FALSE)","v":false}]
[null,"Totale degli apporti da matrici organiche ",null,null,null,null,null,null,null,null,null,null,null,{"$f":"SUM(N7,N10,N13)","v":0},{"$f":"SUM(O7,O10,O13)","v":0},null,null,null,null,null,null,null,null,null,null,{"$f":"SUM(Z7,Z10,Z13)","v":0},{"$f":"SUM(AA7,AA10,AA13)","v":0},{"$f":"SUM(AB7,AB10,AB13)","v":0},{"$f":"(+AC7+AC10+AC13)","v":0}]
[]
[null,"Concimi minerali e di sintesi",null,null,null,null,null,"titoli kg/q",null,null,null,"q/ha",null,null,null,null,null,"Epoca e modalità di distribuzione"]
[]
[null,null,null,null,null,null,{"$f":"Concimi!D153","v":5},{"$f":"Concimi!E153","v":0},{"$f":"Concimi!F153","v":0},null,null,null,null,null,null,null,null,null,null,null,null,null,null,100,null,{"$f":"($L19*($X19/100)*G19)","v":0},{"$f":"($L19*($X19/100)*H19)","v":0},0]
[]
[null,null,null,null,null,null,{"$f":"Concimi!D156","v":0},{"$f":"Concimi!E156","v":0},{"$f":"Concimi!F156","v":0},null,null,null,null,null,null,null,null,null,null,null,null,null,null,100,null,{"$f":"($L21*($X21/100)*G21)","v":0},{"$f":"($L21*($X21/100)*H21)","v":0},{"$f":"($L21*($X21/100)*I21)","v":0}]
[]
[null,null,null,null,null,null,{"$f":"Concimi!D159","v":0},{"$f":"Concimi!E159","v":0},{"$f":"Concimi!F159","v":0},null,null,null,null,null,null,null,null,null,null,null,null,null,null,100,null,{"$f":"($L23*($X23/100)*G23)","v":0},{"$f":"($L23*($X23/100)*H23)","v":0},{"$f":"($L23*($X23/100)*I23)","v":0}]
[]
[null,null,null,null,null,null,{"$f":"Concimi!D162","v":0},{"$f":"Concimi!E162","v":0},{"$f":"Concimi!F162","v":0},null,null,null,null,null,null,null,null,null,null,null,null,null,null,100,null,{"$f":"($L25*($X25/100)*G25)","v":0},{"$f":"($L25*($X25/100)*H25)","v":0},{"$f":"($L25*($X25/100)*I25)","v":0}]
[]
[null,null,null,null,null,null,null,null,null,null,null,null,null,null,null,null,null,null,null,null,null,null,null,100,null,{"$f":"($L27*($X27/100)*G27)","v":0},{"$f":"($L27*($X27/100)*H27)","v":0},{"$f":"($L27*($X27/100)*I27)","v":0}]
[]
[null,null,null,null,null,null,null,null,null,null,null,null,null,null,null,null,null,null,null,null,null,null,null,100,null,{"$f":"($L29*($X29/100)*G29)","v":0},{"$f":"($L29*($X29/100)*H29)","v":0},{"$f":"($L29*($X29/100)*I29)","v":0}]
[]
[null,null,null,null,null,null,null,null,null,null,null,null,null,null,null,null,null,null,null,null,null,null,null,100,null,{"$f":"($L31*($X31/100)*G31)","v":0},{"$f":"($L31*($X31/100)*H31)","v":0},{"$f":"($L31*($X31/100)*I31)","v":0}]
[]
[null,null,null,null,null,null,null,null,null,null,null,null,null,null,null,null,null,null,null,null,null,null,null,100,null,{"$f":"($L33*($X33/100)*G33)","v":0},{"$f":"($L33*($X33/100)*H33)","v":0},{"$f":"($L33*($X33/100)*I33)","v":0}]
[]
[null,"Totale degli apporti da concimi",null,null,null,null,null,null,null,null,null,null,null,null,null,null,null,null,null,null,null,null,null,null,null,{"$f":"SUM(Z19,Z21,Z23,Z25,Z27,Z29,Z31,Z33)","v":0},{"$f":"SUM(AA19,AA21,AA23,AA25,AA27,AA29,AA31,AA33)","v":0},{"$f":"SUM(AB19,AB21,AB23,AB25,AB27,AB29,AB31,AB33)","v":0}]
[]
[null,"Apporti  utili complessivi",null,null,null,null,null,null,null,null,null,null,null,null,null,null,null,null,null,null,null,null,null,null,null,{"$f":"(Z15+Z35)","v":0},{"$f":"(AA15+AA35)","v":0},{"$f":"(AB15+AB35)","v":0},{"$f":"AC15","v":0}]
[null,null,null,null,null,null,null,null,null,null,null,null,null,null,null,null,null,null,null,null,null,null,null,null,null,{"$f":"IF(Z37<=Z4,\"OK\",\"Eccesso\")","v":"OK"},{"$f":"IF(AA37<=AA4,\"OK\",\"Eccesso\")","v":"OK"},{"$f":"IF(AB37<=AB4,\"OK\",\"Eccesso\")","v":"OK"},{"$f":"IF(AC37<=AC4,\"OK\",\"Eccesso\")","v":"OK"}]
[null,"Copertura del fabbisogno con unità fornite dai concimi minerali o di sintesi",null,null,null,null,null,null,null,null,null,null,null,null,null,null,null,null,null,null,null,null,null,null,null,{"$f":"IF(OR(Z4=0,Z35=0),\" \",('Apporti al terreno'!M22/Distribuz!Z4)*100)","v":" "},{"$f":"IF(OR(AA4=0,AA37=0),\" \",('Apporti al terreno'!P22/Distribuz!AA4)*100)","v":" "},{"$f":"IF(OR(AB4=0,AB35=0),\" \",('Apporti al terreno'!S22/Distribuz!AB4)*100)","v":" "}]

{"sheet":"Registra_Piano","index":12,"n_rows":38,"n_cols":21,"rows_kept":38,"cut":false,"hidden":false,"merged":[[15,0,17,0],[18,0,25,0],[37,15,38,18],[33,1,35,10],[33,12,34,18],[6,15,6,20],[29,2,31,10],[14,1,14,11]]}
["Scheda di registrazione del Piano di Fertilizzazione ",null,null,null,null,null,null,"Metodo",{"$f":"Metodo!C8","v":"Bilancio "},null,null,null,"Anno",{"$f":"Inserimento!T5","v":2019},null,"Regione Emilia Romagna"]
[]
["Rag. Sociale",null,{"$f":"Inserimento!B5","v":"Pinco Pallino"}]
[]
["Area omogenea",null,{"$f":"Inserimento!N5","v":"A"},null,"Appezzamento",null,{"$f":"Inserimento!Q5","v":1},null,"Tessitura",null,{"$f":"Inserimento!F21","v":"Argillosi e limosi"}]
[]
["Coltura",{"$f":"Coltura!D225","v":"Segale da seme (granella)"},null,null,null,null,null,null,"Resa (t/ha)",null,{"$f":"Inserimento!T10","v":4},null,null,"Precessione",null,{"$f":"E!B28","v":"Cereale autunno-vern. Paglia asportata"}]
[]
["Fase",{"$f":"Cicli_Fase!F31","v":"Autunno-vernina <150 gg"}]
[null,null,null,null,null,null,null,null,null,null,null,null,"Azoto (*)",null,null,"Fosforo",null,null,"Potassio",null,"S.O."]
[null,null,null,null,null,null,null,null,null,null,null,null,"N",null,null,"P2O5",null,null,"K2O",null,"ss"]
[null,null,null,null,null,null,null,null,null,null,null,null,"kg/ha",null,null,"kg/ha",null,null,"kg/ha",null,"t/ha"]
[null,null,"Quantità massime che è possibile apportare",null,null,null,null,null,null,null,null,null,{"$f":"Distribuz!Z4","v":120.03},null,null,{"$f":"Distribuz!AA4","v":0},null,null,{"$f":"Distribuz!AB4","v":0},null,{"$f":"SO!F9","v":13}]
[]
["tipo","Quantità ed epoca di distribuzione dei fertilizzanti"]
["Organici"]
[]
[]
["Minerali o di sintesi"]
[]
[]
[]
[]
[]
[]
[]
[]
[null,null,"Apporti totali",null,null,null,null,null,null,null,null,null,{"$f":"SUM(M16:M26)","v":0},null,null,{"$f":"SUM(P16:P26)","v":0},null,null,{"$f":"SUM(S16:S26)","v":0},null,{"$f":"SUM(U16:U18)","v":0}]
[null,null,null,null,null,null,null,null,null,null,null,null,{"$f":"IF(M28>M13,\"Eccesso\",\"OK\")","v":"OK"},null,null,{"$f":"IF(P28>P13,\"Eccesso\",\"OK\")","v":"OK"},null,null,{"$f":"IF(S28>S13,\"Eccesso\",\"OK\")","v":"OK"}]
[null,null,"Dotazioni finali nel terreno se si apportano le quantità di fertilizzanti riportate nel piano. Valori da utilizzare nel piano del prossimo anno",null,null,null,null,null,null,null,null,null,null,null,null,"ppm",null,null,"ppm"]
[null,null,null,null,null,null,null,null,null,null,null,null,null,null,null,"P2O5",null,null,"K2O"]
[]
[]
["Note",null,null,null,null,null,null,null,null,null,null,null,"% di copertura del fabbisogno con unità fornite dai concimi minerali o di sintesi"]
[]
[null,null,null,null,null,null,null,null,null,null,null,null,{"$f":"IF(OR(M13=0,M28=0),\" \",((+M19+M20+M21+M22+M23+M24+M25+M26)/M13)*100)","v":" "},null,null,{"$f":"IF(OR(P13=0,P28=0),\" \",((+P19+P20+P21+P22+P23+P24+P25+P26)/P13)*100)","v":" "},null,null,{"$f":"IF(OR(S13=0,S28=0),\" \",((+S19+S20+S21+S22+S23+S24+S25+S26)/S13)*100)","v":" "}]
[]
[null,null,null,null,null,null,null,null,null,null,null,null,null,"Estensore"]

{"sheet":"Apporti al terreno","index":13,"n_rows":41,"n_cols":22,"rows_kept":41,"cut":false,"hidden":false,"merged":[[21,7,21,9],[11,7,11,9],[3,2,3,5],[6,2,6,5],[9,2,9,5]]}
[null,"Apporti",null,null,null,null,"Coltura",{"$f":"Coltura!D225","v":"Segale da seme (granella)"},"effic.",null,null,"N",null,null,null,"P2O5",null,null,"K2O","SO ss (t/ha)",null," *) per i concimi si considera un 5% di materia organica non mineralizzata e per l'azoto anche una perdita del 10% per volatilizzazione"]
[null,"fertilizz org. a cessione graduale",null,null,null,null,"t/ha","Ciclo_Modalità epoca","%",null,"org.","zootec.","min.",null,null,null,null,null,null,"totale","incr. SO aa"," **) per gli ammendanti si considera il fattore tempo e per i liquami il coefficiente di efficienza"]
["Fert. 1",{"$f":"Fert_org!C27","v":"letame bovino"},null,null,null,null,{"$f":"Distribuz!L7","v":0},{"$f":"Ciclo_Modalità!F44","v":"In copertura nella fase di levata"},{"$f":"IF(Fert_org!E27=1,0,IF(Fert_org!E27<4,Ciclo_Modalità!L44,Efficienza!F223))","v":40},"al campo",{"$f":"Distribuz!N7","v":0},{"$f":"Distribuz!O7","v":0},null,null,null,{"$f":"IF(Fert_org!$E27>1,(Distribuz!H7*Distribuz!L7),0)","v":0},null,null,{"$f":"IF(Fert_org!E27>1,(Distribuz!I7*Distribuz!L7),0)","v":0},{"$f":"IF(Fert_org!E27>1,(Distribuz!L7*Distribuz!J7)/100,0)","v":0}]
[null,null,"anno",null,null,null,{"$f":"Distribuz!Q7","v":0},null," *","disponibili nell'annata",null,null,{"$f":"IF(Fert_org!$E27<4,(K3*I3)/100,K3*0.85)","v":0},null,null,{"$f":"IF(Fert_org!E27<4,(P3*$I3)/100,P3*0.95)","v":0},null,null,{"$f":"IF(Fert_org!E27<4,(S3*$I3)/100,S3*0.95)","v":0},null,{"$f":"IF(AND(Fert_org!S27=1,(Codici!D2=Codici!DT2)),'Apporti al terreno'!T3,0)","v":0}]
[null,null,null,null,null,null,null,null," **","utili alla coltura",null,null,{"$f":"IF(Fert_org!$E27<4,(M4*C_tempo!$C$22),((Distribuz!G7*Distribuz!$L7)*'Apporti al terreno'!$I3)/100)","v":0},null,null,{"$f":"IF(Fert_org!$E27<4,(P4*C_tempo!$C$22),((Distribuz!H7*Distribuz!$L7)*'Apporti al terreno'!$I3)/100)","v":0},null,null,{"$f":"IF(Fert_org!$E27<4,(S4*C_tempo!$C$22),((Distribuz!I7*Distribuz!$L7)*'Apporti al terreno'!$I3)/100)","v":0}]
["Fert. 2",{"$f":"Fert_org!C29","v":"liquame bovini da carne"},null,null,null,null,{"$f":"Distribuz!L10","v":20},{"$f":"Ciclo_Modalità!F46","v":"Su residui pagliosi e semina nel medesimo anno "},{"$f":"IF(Fert_org!E29=1,0,IF(Fert_org!E29<4,40,Efficienza!F225))","v":39.1},"al campo",{"$f":"Distribuz!N10","v":0},{"$f":"Distribuz!O10","v":0},null,null,null,{"$f":"IF(Fert_org!E29>1,(Distribuz!H10*Distribuz!L10),0)","v":0},null,null,{"$f":"IF(Fert_org!E29>1,(Distribuz!I10*Distribuz!L10),0)","v":0},{"$f":"IF(Fert_org!E29>1,(Distribuz!L10*Distribuz!J10)/100,0)","v":0}]
[null,null,"anno",null,null,null,{"$f":"Distribuz!Q10","v":0},null," *","disponibili nell'annata",null,null,{"$f":"IF(Fert_org!$E29<4,(K6*I6)/100,K6*0.85)","v":0},null,null,{"$f":"IF(Fert_org!E29<4,(P6*$I6)/100,P6*0.95)","v":0},null,null,{"$f":"IF(Fert_org!E29<4,(S6*$I6)/100,S6*0.95)","v":0},null,{"$f":"IF(AND(Fert_org!S29=1,(Codici!D2=Codici!DU2)),'Apporti al terreno'!T6,0)","v":0}]
[null,null,null,null,null,null,null,null," **","utili alla coltura",null,null,{"$f":"IF(Fert_org!$E29<4,(M7*C_tempo!$C$22),((Distribuz!G10*Distribuz!$L10)*'Apporti al terreno'!$I6)/100)","v":0},null,null,{"$f":"IF(Fert_org!$E29<4,(P7*C_tempo!$C$22),((Distribuz!H10*Distribuz!$L10)*'Apporti al terreno'!$I6)/100)","v":0},null,null,{"$f":"IF(Fert_org!$E29<4,(S7*C_tempo!$C$22),((Distribuz!I10*Distribuz!$L10)*'Apporti al terreno'!$I6)/100)","v":0}]
["Fert. 3",{"$f":"Fert_org!C31","v":"z nessuno"},null,null,null,null,{"$f":"Distribuz!L13","v":0},{"$f":"Ciclo_Modalità!F48","v":"In copertura nella fase di levata"},{"$f":"IF(Fert_org!E31=1,0,IF(Fert_org!E31<4,40,Efficienza!F227))","v":0},"al campo",{"$f":"Distribuz!N13","v":0},{"$f":"Distribuz!O13","v":0},null,null,null,{"$f":"IF(Fert_org!E31>1,(Distribuz!H13*Distribuz!L13),0)","v":0},null,null,{"$f":"IF(Fert_org!E31>1,(Distribuz!I13*Distribuz!L13),0)","v":0},{"$f":"IF(Fert_org!E31>1,(Distribuz!L13*Distribuz!J13)/100,0)","v":0}]
[null,null,"anno",null,null,null,{"$f":"Distribuz!Q13","v":0},null," *","disponibili nell'annata",null,null,{"$f":"IF(Fert_org!$E31<4,(K9*I9)/100,K9*0.85)","v":0},null,null,{"$f":"IF(Fert_org!E31<4,(P9*$I9)/100,P9*0.95)","v":0},null,null,{"$f":"IF(Fert_org!E31<4,(S9*$I9)/100,S9*0.95)","v":0},null,{"$f":"IF(AND(Fert_org!S31=1,(Codici!D5=Codici!DU5)),'Apporti al terreno'!T9,0)","v":0}]
[null,null,null,null,null,null,null,null," **","utili alla coltura",null,null,{"$f":"IF(Fert_org!$E31<4,(M10*C_tempo!$C$22),((Distribuz!G13*Distribuz!$L13)*$I9)/100)","v":0},null,null,{"$f":"IF(Fert_org!$E31<4,(P10*C_tempo!$C$22),((Distribuz!H13*Distribuz!$L13)*$I9)/100)","v":0},null,null,{"$f":"IF(Fert_org!$E31<4,(S10*C_tempo!$C$22),((Distribuz!I13*Distribuz!$L13)*$I9)/100)","v":0}]
[null,null,null,null,null,null,null,"Totale unità di origine organica utili alla coltura",null,null,null,null,{"$f":"(+M5+M8+M11)","v":0},null,null,{"$f":"(+P5+P8+P11)","v":0},null,null,{"$f":"(+S5+S8+S11)","v":0}]
[null,"Concimi minerali o di sintesi",null,null,null,null,"q/ha","modalità"]
["Conc. 1",{"$f":"Concimi!C153","v":"FERROUMATO"},null,null,null,null,{"$f":"Distribuz!L19","v":0},{"$f":"Distribuz!R19","v":0},null,null,null,null,{"$f":"(Distribuz!G19*Distribuz!$L19)","v":0},null,null,{"$f":"(Distribuz!H19*Distribuz!$L19)","v":0},null,null,{"$f":"(Distribuz!I19*Distribuz!$L19)","v":0}]
["Conc. 2",{"$f":"Concimi!C156","v":"Nessuno"},null,null,null,null,{"$f":"Distribuz!L21","v":0},{"$f":"Distribuz!R21","v":0},null,null,null,null,{"$f":"(Distribuz!G21*Distribuz!$L21)","v":0},null,null,{"$f":"(Distribuz!H21*Distribuz!$L21)","v":0},null,null,{"$f":"(Distribuz!I21*Distribuz!$L21)","v":0}]
["Conc. 3",{"$f":"Concimi!C159","v":"Nessuno"},null,null,null,null,{"$f":"Distribuz!L23","v":0},{"$f":"Distribuz!R23","v":0},null,null,null,null,{"$f":"(Distribuz!G23*Distribuz!$L23)","v":0},null,null,{"$f":"(Distribuz!H23*Distribuz!$L23)","v":0},null,null,{"$f":"(Distribuz!I23*Distribuz!$L23)","v":0}]
["Conc. 4",{"$f":"Concimi!C162","v":"Nessuno"},null,null,null,null,{"$f":"Distribuz!L25","v":0},{"$f":"Distribuz!R25","v":0},null,null,null,null,{"$f":"(Distribuz!G25*Distribuz!$L25)","v":0},null,null,{"$f":"(Distribuz!H25*Distribuz!$L25)","v":0},null,null,{"$f":"(Distribuz!I25*Distribuz!$L25)","v":0}]
["Conc. 5",{"$f":"Distribuz!B27","v":0},null,null,null,null,{"$f":"Distribuz!L27","v":0},{"$f":"Distribuz!R27","v":0},null,null,null,null,{"$f":"(Distribuz!G27*Distribuz!$L27)","v":0},null,null,{"$f":"(Distribuz!H27*Distribuz!$L27)","v":0},null,null,{"$f":"(Distribuz!I27*Distribuz!$L27)","v":0}]
["Conc. 6",{"$f":"Distribuz!B29","v":0},null,null,null,null,{"$f":"Distribuz!L29","v":0},{"$f":"Distribuz!R29","v":0},null,null,null,null,{"$f":"(Distribuz!G29*Distribuz!$L29)","v":0},null,null,{"$f":"(Distribuz!H29*Distribuz!$L29)","v":0},null,null,{"$f":"(Distribuz!I29*Distribuz!$L29)","v":0}]
["Conc. 7",{"$f":"Distribuz!B31","v":0},null,null,null,null,{"$f":"Distribuz!L31","v":0},{"$f":"Distribuz!R31","v":0},null,null,null,null,{"$f":"(Distribuz!G31*Distribuz!$L31)","v":0},null,null,{"$f":"(Distribuz!H31*Distribuz!$L31)","v":0},null,null,{"$f":"(Distribuz!I31*Distribuz!$L31)","v":0}]
["Conc. 8",{"$f":"Distribuz!B33","v":0},null,null,null,null,{"$f":"Distribuz!L33","v":0},{"$f":"Distribuz!R33","v":0},null,null,null,null,{"$f":"(Distribuz!G33*Distribuz!$L33)","v":0},null,null,{"$f":"(Distribuz!H33*Distribuz!$L33)","v":0},null,null,{"$f":"(Distribuz!I33*Distribuz!$L33)","v":0}]
[null,null,null,null,null,null,null,"Totale unità da concimi minerali o di sintesi utili alla coltura",null,null,null,null,{"$f":"SUM(M14:M21)","v":0},null,null,{"$f":"SUM(P14:P21)","v":0},null,null,{"$f":"SUM(S14:S21)","v":0}]
[]
["Totale delle disponibilità annuali al terreno",null,null,null,null,null,null,"Totale delle disponibilità utili alla coltura",null,null,null,null,{"$f":"(M12+M22)","v":0},{"$f":"(N12+N22)","v":0},0,0,0,0,0,{"$f":"(T3+T6+T9)","v":0}]
["kg che modificano il tenore dell'elemento nel terreno",null,null,null,null,null,null,null,null,null,null,null,null,null,null,{"$f":"(P24-Bilancio!I15)","v":-28},null,null,{"$f":"(S24-(Bilancio!J15+Bilancio!J16))","v":-30}]
["Dotazione finale nel terreno se si apportano le quantità indicate nel piano di distribuzione",null,null,null,null,null,null,null,null,null,"Come P2O5 e K2O",null,null,null,null,{"$f":"Gri_P!D27","v":89.3680361757106},null,null,{"$f":"Gri_K!C36","v":379.88598556237213}]
[null,null,null,null,null,null,null,null,null,null,"Come P e K",null,null,null,null,{"$f":"Gri_P!D28","v":39.02532340524548},null,null,{"$f":"Gri_K!C37","v":316.57038834869155}]
[null,null,null,null,null,null,null,"Riquadro per scheda distribuzioni",null,null,null,null,"Utili alla coltura"]
[1,{"$f":"IF(B3=\"z nessuno\",\" \",CONCATENATE(G3,\" t/ha di \",B3,\" \",H3,\"-\",G4))","v":"0 t/ha di letame bovino In copertura nella fase di levata-0"},null,null,null,null,null,null,null,null,null,null,{"$f":"M5","v":0},null,null,{"$f":"P5","v":0},null,null,{"$f":"S5","v":0},null,{"$f":"U4","v":0}]
[2,{"$f":"IF(B6=\"z nessuno\",\" \",CONCATENATE(G6,\" t/ha di \",B6,\" \",H6,\"-\",G7))","v":"20 t/ha di liquame bovini da carne Su residui pagliosi e semina nel medesimo anno -0"},null,null,null,null,null,null,null,null,null,null,{"$f":"M8","v":0},null,null,{"$f":"P8","v":0},null,null,{"$f":"S8","v":0},null,{"$f":"U7","v":0}]
[3,{"$f":"IF(B9=\"z nessuno\",\" \",CONCATENATE(G9,\" t/ha di \",B9,\" \",H9,\"- \",G10))","v":" "},null,null,null,null,null,null,null,null,null,null,{"$f":"M11","v":0},null,null,{"$f":"P11","v":0},null,null,{"$f":"S11","v":0},null,{"$f":"U10","v":0}]
[4,{"$f":"IF(B14=\"Nessuno\",\" \",CONCATENATE(G14,\" q/ha di \",B14,\" \",H14))","v":"0 q/ha di FERROUMATO 0"},null,null,null,null,null,null,null,null,null,null,{"$f":"M14","v":0},null,null,{"$f":"P14","v":0},null,null,{"$f":"S14","v":0}]
[5,{"$f":"IF(B15=\"Nessuno\",\" \",CONCATENATE(G15,\" q/ha di \",B15,\" \",H15))","v":" "},null,null,null,null,null,null,null,null,null,null,0,null,null,0,null,null,0]
[6,{"$f":"IF(B16=\"Nessuno\",\" \",CONCATENATE(G16,\" q/ha di \",B16,\" \",H16))","v":" "},null,null,null,null,null,null,null,null,null,null,0,null,null,0,null,null,0]
[7,{"$f":"IF(B17=\"Nessuno\",\" \",CONCATENATE(G17,\" q/ha di \",B17,\" \",H17))","v":" "},null,null,null,null,null,null,null,null,null,null,0,null,null,0,null,null,0]
[8,{"$f":"IF(ISBLANK(Distribuz!B27),\" \",CONCATENATE(G18,\" q/ha di \",B18,\" \",H18))","v":" "},null,null,null,null,null,null,null,null,null,null,0,null,null,0,null,null,0]
[9,{"$f":"IF(ISBLANK(Distribuz!B29),\" \",CONCATENATE(G19,\" q/ha di \",B19,\" \",H19))","v":" "},null,null,null,null,null,null,null,null,null,null,0,null,null,0,null,null,0]
[10,{"$f":"IF(ISBLANK(Distribuz!B31),\" \",CONCATENATE(G20,\" q/ha di \",B20,\" \",H20))","v":" "},null,null,null,null,null,null,null,null,null,null,0,null,null,0,null,null,0]
[11,{"$f":"IF(ISBLANK(Distribuz!B33),\" \",CONCATENATE(G21,\" q/ha di \",B21,\" \",H21))","v":" "},null,null,null,null,null,null,null,null,null,null,0,null,null,0,null,null,0]
[]
["Totale delle disponibilità utili alla coltura",null,null,null,null,null,null,null,null,null,null,null,{"$f":"SUM(M29:M39)","v":0},null,null,{"$f":"SUM(P29:P39)","v":0},null,null,{"$f":"SUM(S29:S39)","v":0}]

{"sheet":"Cicli_Fase","index":14,"n_rows":31,"n_cols":13,"rows_kept":31,"cut":false,"hidden":true,"merged":[]}
[null,"Cciclo",null,null,"Fase colturale_ durata ciclo",null,"Stagione di crescita",null,"Combinazioni tra Macro Categoria e Fase-Durata"]
[null,"ID_Cic","ciclo",null,"ID_Fa_D","Fase-durata","ID_Sta","Stagione di crescita","Macro C.","L.Ciclo","intervallo","da","a"]
[null,"c","baby life",null,1,"pre impianto",9,"non definita","arboree","p","F3:H6",1,4]
[null,"m","inferiore all'anno",null,2,"I anno allev.",3,"anno","erbacee","c","F7:H9",5,7]
[null,"p","pluriennale",null,3,"II anno allev.",3,"anno","erbacee","m","F10:H16",8,14]
[null,null,null,null,4,"piena produzione",3,"anno","erbacee","p","F17:H19",15,17]
[null,null,"Macro categoria",null,5,"1° taglio",8,"breve","erbacee","i","F10:H16",8,14]
[null,null,"Macro C",null,6,"2° taglio o succ.",8,"breve"]
[null,null,"arboree",null,7,"un ciclo intero",8,"breve"]
[null,null,"erbacee",null,8,"secondo raccolto",2,"estate autunno"]
[null,null,null,null,9,"Primaverile-estiva <70 gg",5,"primavera estate"]
[null,null,null,null,10,"Primaverile-estiva  70–100 gg",5,"primavera estate"]
[null,null,null,null,11,"Primaverile-estiva  100–130 gg",5,"primavera estate"]
[null,null,null,null,12,"Primaverile-estiva  >130 gg",5,"primavera estate"]
[null,null,null,null,13,"Autunno-vernina <150 gg",1,"autunno inverno primavera"]
[null,null,null,null,14,"Autunno-vernina >150 gg",1,"autunno inverno primavera"]
[null,null,null,null,15,"pre impianto autunno",7,"autunno inverno"]
[null,null,null,null,16,"1° anno - impianto a primavera",6,"primavera estate autunno inverno"]
[null,null,null,null,17,"In produzione",4,"anno"]
[null,null,null,null,"prog",null,null,null,"Macro C.","L.Ciclo"]
[null,null,null,null,1,{"$f":"INDIRECT(K21)","v":"secondo raccolto"},null,null,{"$f":"Gruppo!G9","v":"erbacee"},{"$f":"Coltura!F225","v":"m"},{"$f":"DGET($I$2:$M$7,K2,$I$20:$J$21)","v":"F10:H16"},{"$f":"DGET($I$2:$M$7,L2,$I$20:$J$21)","v":8},{"$f":"DGET($I$2:$M$7,M2,$I$20:$J$21)","v":14}]
[null,null,null,null,2,"Primaverile-estiva <70 gg",null,null,"Matrice fase:",null,"Cicli_Fase.F10:H16"]
[null,null,null,null,3,"Primaverile-estiva  70–100 gg"]
[null,null,null,null,4,"Primaverile-estiva  100–130 gg"]
[null,null,null,null,5,"Primaverile-estiva  >130 gg"]
[null,null,null,null,6,"Autunno-vernina <150 gg"]
[null,null,null,null,7,"Autunno-vernina >150 gg"]
[null,null,null,null,null,"Criterio Selezionato"]
[null,null,null,null,"prog","ID_Fa_D"]
[null,null,null,null,{"$f":"Codici!H2","v":6},{"$f":"(E30+L21-1)","v":13},{"$f":"DGET($E$2:$H$19,G2,$F$29:$F$30)","v":1},{"$f":"DGET($E$2:$H$19,H2,$F$29:$F$30)","v":"autunno inverno primavera"}]
[null,null,null,null,null,{"$f":"DGET(E2:F19,F2,F29:F30)","v":"Autunno-vernina <150 gg"}]

{"sheet":"C_tempo","index":15,"n_rows":22,"n_cols":19,"rows_kept":22,"cut":false,"hidden":true,"merged":[]}
["Coefficiente tempo in funzione di: Macro c., Ciclo e fase",null,null,null,"apporti consentiti %"]
["ID_Fa_D","Fase colturale_ciclo","C_tempo","Precessione da conteggiare","N","P2O5","K2O","anticipaz.","allevamento","ID_Sta"]
[{"$f":"Cicli_Fase!E3","v":1},{"$f":"Cicli_Fase!F3","v":"pre impianto"},0.2,"sì",0,1,1,"sì","no",9]
[{"$f":"Cicli_Fase!E4","v":2},{"$f":"Cicli_Fase!F4","v":"I anno allev."},1,"no",0.4,0.3,0.3,"no","sì",3]
[{"$f":"Cicli_Fase!E5","v":3},{"$f":"Cicli_Fase!F5","v":"II anno allev."},1,"no",0.5,0.5,0.5,"no","sì",3]
[{"$f":"Cicli_Fase!E6","v":4},{"$f":"Cicli_Fase!F6","v":"piena produzione"},1,"no",1,1,1,"no","no",3]
[{"$f":"Cicli_Fase!E7","v":5},{"$f":"Cicli_Fase!F7","v":"1° taglio"},0.11,"no",1,1,1,"no","no",8]
[{"$f":"Cicli_Fase!E8","v":6},{"$f":"Cicli_Fase!F8","v":"2° taglio o succ."},0.1,"no",1,1,1,"no","no",8]
[{"$f":"Cicli_Fase!E9","v":7},{"$f":"Cicli_Fase!F9","v":"un ciclo intero"},0.12,"no",1,1,1,"no","no",8]
[{"$f":"Cicli_Fase!E10","v":8},{"$f":"Cicli_Fase!F10","v":"secondo raccolto"},0.35,"no",1,1,1,"no","no",2]
[{"$f":"Cicli_Fase!E11","v":9},{"$f":"Cicli_Fase!F11","v":"Primaverile-estiva <70 gg"},0.3,"sì",1,1,1,"no","no",5]
[{"$f":"Cicli_Fase!E12","v":10},{"$f":"Cicli_Fase!F12","v":"Primaverile-estiva  70–100 gg"},0.5,"sì",1,1,1,"no","no",5]
[{"$f":"Cicli_Fase!E13","v":11},{"$f":"Cicli_Fase!F13","v":"Primaverile-estiva  100–130 gg"},0.67,"sì",1,1,1,"no","no",5]
[{"$f":"Cicli_Fase!E14","v":12},{"$f":"Cicli_Fase!F14","v":"Primaverile-estiva  >130 gg"},0.75,"sì",1,1,1,"no","no",5]
[{"$f":"Cicli_Fase!E15","v":13},{"$f":"Cicli_Fase!F15","v":"Autunno-vernina <150 gg"},0.5,"sì",1,1,1,"no","no",1]
[{"$f":"Cicli_Fase!E16","v":14},{"$f":"Cicli_Fase!F16","v":"Autunno-vernina >150 gg"},0.6,"sì",1,1,1,"no","no",1]
[{"$f":"Cicli_Fase!E17","v":15},{"$f":"Cicli_Fase!F17","v":"pre impianto autunno"},0.35,"sì",0,1,1,"sì","no",7,null,0.75,"sì",1,1,1,"sì","no",6]
[{"$f":"Cicli_Fase!E18","v":16},{"$f":"Cicli_Fase!F18","v":"1° anno - impianto a primavera"},0.75,"sì",1,1,1,"sì","no",6,null,0.35,"no",1,1,1,"sì","no",7]
[{"$f":"Cicli_Fase!E19","v":17},{"$f":"Cicli_Fase!F19","v":"In produzione"},1,"no",1,1,1,"no","no",4]
[null,2,3,4,5,6,7,8,9,10]
["ID_Fa_D"]
[{"$f":"Cicli_Fase!F30","v":13},{"$f":"DGET($A$2:$J$19,B20,$A$21:$A$22)","v":"Autunno-vernina <150 gg"},{"$f":"DGET($A$2:$J$19,C20,$A$21:$A$22)","v":0.5},"sì",1,1,1,"no","no",1]

{"sheet":"Metodo","index":16,"n_rows":8,"n_cols":4,"rows_kept":8,"cut":false,"hidden":true,"merged":[]}
[null,null,"Selezione","Possibilità"]
[null,"ID_Met","Metodo"]
[null,1,"Bilancio ",{"$f":"A!G228","v":"sì"}]
[null,2,"Schede",{"$f":"IF(Standard!E233=\"nd\",\"no\",\"sì\")","v":"sì"}]
[]
[null,"criterio"]
[null,"ID_Met"]
[null,{"$f":"Codici!E2","v":1},{"$f":"VLOOKUP(B8,B2:C4,2)","v":"Bilancio "},{"$f":"VLOOKUP(C8,C2:D4,2)","v":"sì"}]

{"sheet":"Ciclo_Modalità","index":17,"n_rows":48,"n_cols":14,"rows_kept":48,"cut":false,"hidden":true,"merged":[]}
["Livello di efficienza dei fertilizzanti organici in relazione al ciclo colturale e alle modalità di distribuzione",null,null,null,null,null,null,null,null,null,null,"Zona di selezione in funzione  del ciclo e  della stagione vegetativa"]
[null,"ID_Cic_Mo","Prog_Cic","ID_Sta","ID_Mo","Modalità_Epoca","ID_Liv","livello","anno raccolta",null,null,"ID_Sta","zona_ciclo"]
[null,1,1,1,3,"Alla preparazione del terreno e semina nel medesimo anno",1,"bassa","no",null,null,1,"F3:H7"]
[null,2,2,1,9,"Su residui pagliosi e semina nel medesimo anno ",2,"media","no",null,null,2,"F8:H12"]
[null,3,3,1,10,"Presemina o in copertura in autunno",1,"bassa","no",null,null,3,"F15:H19"]
[null,4,4,1,11,"In copertura nella fase di pieno accestimento (fine inverno)",2,"media","sì",null,null,4,"F20:H22"]
[null,5,5,1,12,"In copertura nella fase di levata",3,"alta","sì",null,null,5,"F23:H30"]
[null,6,1,2,10,"Presemina",3,"alta","sì",null,null,6,"F31:H36"]
[null,7,2,2,6,"In copertura con interramento",3,"alta","sì",null,null,7,"F37:H38"]
[null,8,3,2,4,"In copertura in fertirrigazione",2,"media","sì",null,null,8,"F39:H40"]
[null,9,4,2,5,"In copertura con fertirrigazione a bassa pressione",3,"alta","sì",null,null,9,"F13:H14"]
[null,10,5,2,8,"In copertura in estate senza interramento",1,"bassa","sì",null,null,"ID_Cic","zona_ciclo"]
[null,11,1,9,16,"Preimpianto distante dalla crescita",1,"bassa","no",null,null,{"$f":"C_tempo!J22","v":1},{"$f":"VLOOKUP(L13,L2:M11,2)","v":"F3:H7"},{"$f":"CONCATENATE(\"Ciclo_Modalità!\",M13)","v":"Ciclo_Modalità!F3:H7"}]
[null,{"$f":"(B13+1)","v":12},2,9,17,"Preimpianto vicino dalla crescita",2,"media","sì"]
[null,{"$f":"(B14+1)","v":13},1,3,18,"In primavera su frutteto inerbito o con interramento",3,"alta","si"]
[null,14,2,3,19,"In estate o fine inverno su frutteto inerbito o con interramento",2,"media","sì"]
[null,15,3,3,20,"In primavera su frutteto lavorato senza interramento",2,"media","sì",null,null,null,"Prog_Cic","Modalità_Epoca"]
[null,16,4,3,21,"In estate autunno su frutteto lavorato senza interramento",1,"bassa","sì",null,null,null,1,{"$f":"INDIRECT(N13)","v":"Alla preparazione del terreno e semina nel medesimo anno"}]
[null,17,5,3,15,"Tardo autunno (>15/10)",1,"bassa","sì",null,null,null,2,"Su residui pagliosi e semina nel medesimo anno "]
[null,18,1,4,13,"Ripresa vegetativa e tagli primaverili",3,"alta","sì",null,null,null,3,"Presemina o in copertura in autunno"]
[null,19,2,4,14,"Tagli estivi o autunno precoci (< 15/10)",2,"media","sì",null,null,null,4,"In copertura nella fase di pieno accestimento (fine inverno)"]
[null,20,3,4,15,"Tardo autunno (>15/10)",1,"bassa","sì",null,null,null,5,"In copertura nella fase di levata"]
[null,21,1,5,1,"Su terreno nudo  e semina nell'anno successivo",1,"bassa","no",null,null,null,6,{"$error":"#N/A"}]
[null,22,2,5,2,"Su residui pagliosi e semina nell'anno successivo",2,"media","no",null,null,null,7,{"$error":"#N/A"}]
[null,23,3,5,3,"Alla preparazione del terreno e semina nel medesimo anno",3,"alta","sì",null,null,null,8,{"$error":"#N/A"}]
[null,24,4,5,4,"In copertura con fertirrigazione",2,"media","sì"]
[null,25,5,5,5,"In copertura con fertirrigazione a bassa pressione",3,"alta","si"]
[null,26,6,5,6,"In copertura con interramento",3,"alta","sì"]
[null,27,7,5,7,"In copertura in primavera senza interramento",2,"media","sì"]
[null,28,8,5,8,"In copertura in estate senza interramento",1,"bassa","sì"]
[null,29,1,6,1,"Su terreno nudo  e semina nell'anno successivo (preimpianto)",1,"bassa","no"]
[null,30,2,6,2,"Su residui pagliosi e semina nell'anno successivo (peimpianto)",2,"media","no"]
[null,31,3,6,3,"Alla preparazione del terreno e semina nel medesimo anno",3,"alta","sì"]
[null,32,4,6,13,"Tagli primaverili",3,"alta","sì"]
[null,33,5,6,14,"Tagli estivi o autunno precoci (< 15/10)",2,"media","sì"]
[null,34,6,6,15,"Tardo autunno (>15/10)",1,"bassa","sì"]
[null,35,1,7,3,"Alla preparazione del terreno e semina nel medesimo anno",2,"media","no"]
[null,36,2,7,15,"Tardo autunno (>15/10)",1,"bassa","no"]
[null,37,1,8,22,"Prima o durante il rapido accrescimento",3,"alta","sì"]
[]
[null,1,2,3,4,5,6,7,8,"distribuz.","fabbisogno","ammend."]
[null,null,"criterio",null,null,null,null,null,null,"anno","anno","utilità"]
[null,"ID_Cic_Mo","Prog_Cic","ID_Sta"]
["Fert. 1",{"$f":"DGET($B$2:$H$39,B41,$C43:$D44)","v":5},{"$f":"Codici!AQ2","v":5},{"$f":"L13","v":1},{"$f":"DGET($B$2:$I$39,E41,$C43:$D44)","v":12},{"$f":"DGET($B$2:$I$39,F41,$C43:$D44)","v":"In copertura nella fase di levata"},{"$f":"DGET($B$2:$H$39,G41,$C43:$D44)","v":3},{"$f":"DGET($B$2:$H$39,H41,$C43:$D44)","v":"alta"},{"$f":"DGET($B$2:$I$39,I41,$C43:$D44)","v":"sì"},{"$f":"Distribuz!Q7","v":0},{"$f":"Inserimento!$T$5","v":2019},{"$f":"IF(AND(E44=15,(J44=K44)),0,40)","v":40}]
[null,null,"Prog_Cic","ID_Sta"]
["Fert. 2",{"$f":"DGET($B$2:$I$39,B41,$C45:$D46)","v":2},{"$f":"Codici!AY2","v":2},{"$f":"L13","v":1},{"$f":"DGET($B$2:$I$39,E41,$C45:$D46)","v":9},{"$f":"DGET($B$2:$I$39,F41,$C45:$D46)","v":"Su residui pagliosi e semina nel medesimo anno "},{"$f":"DGET($B$2:$I$39,G41,$C45:$D46)","v":2},{"$f":"DGET($B$2:$I$39,H41,$C45:$D46)","v":"media"},{"$f":"DGET($B$2:$I$39,I41,$C45:$D46)","v":"no"},{"$f":"Distribuz!Q10","v":0},{"$f":"Inserimento!$T$5","v":2019},{"$f":"IF(AND(E46=15,(J46=K46)),0,40)","v":40}]
[null,null,"Prog_Cic","ID_Sta"]
["Fert. 3",{"$f":"DGET($B$2:$I$39,B41,$C47:$D48)","v":5},{"$f":"Codici!BG2","v":5},{"$f":"L13","v":1},{"$f":"DGET($B$2:$I$39,E41,$C47:$D48)","v":12},{"$f":"DGET($B$2:$I$39,F41,$C47:$D48)","v":"In copertura nella fase di levata"},{"$f":"DGET($B$2:$I$39,G41,$C47:$D48)","v":3},{"$f":"DGET($B$2:$I$39,H41,$C47:$D48)","v":"alta"},{"$f":"DGET($B$2:$I$39,I41,$C47:$D48)","v":"sì"},{"$f":"Distribuz!Q13","v":0},{"$f":"Inserimento!$T$5","v":2019},{"$f":"IF(AND(E48=15,(J48=K48)),0,40)","v":40}]

{"sheet":"Concimi","index":18,"n_rows":1569,"n_cols":6,"rows_kept":1569,"cut":false,"hidden":true,"merged":[]}
["Elenco Concimi"]
[null,"ID-Conc_min","Concime","N","P2O5","K2O"]
[null,1,"Nessuno",0,0,0]
[null,2,"Acido fosforico 85%",0,61,0]
[null,3,"AGRESTE  ORG.MIN. 7,5/12/21",7.5,12,21]
[null,4,"AGROFERT MB   ORG.MIN. 10/5/15 +2+16",10,5,15]
[null,5,"AGROFERT MBS   O.MIN. 9,5/5/14,5+2+24",9.5,5,14.5]
[null,6,"AZO TOP   18,5/0/0",18.5,0,0]
[null,7,"AZO TOP   18,5/0/0 +32",18.5,0,0]
[null,8,"Azogold 40 N + 12 SO3",40,0,0]
[null,9,"Azoplus 35 N + 22 SO3",35,0,0]
[null,10,"BELFRUTTO MB   5/10/15 +5+16",5,10,15]
[null,11,"BELFRUTTO MBS KG 25   ORG.MIN. 6/10/15 +2+16",6,10,15]
[null,12,"Calcicianamide oleata",20,0,0]
[null,13,"Calciocianamide granulare",19,0,0]
[null,14,"Calciocianamide in polvere",20,0,0]
[null,15,"CALCIOCIANAMIDE POLV.",19,0,0]
[null,16,"Cloruro di potassio",0,0,60]
[null,17,"FERROUMATO",5,0,0]
[null,18,"FERTIL AGRESTE START KG 50   10/12/7 + 2+12+0,02",10,12,7]
[null,19,"FERTIL MBS   9/14/13 + 2+16+7,6",9,14,13]
[null,20,"Fosfato biammonico 18-46",18,46,0]
[null,21,"Fosfato biammonico 21-52",21,52,0]
[null,22,"Fosfato monoammonico 12-61",12,61,0]
[null,23,"Fosfato monopotassico 0-52-34",0,52,34]
[null,24,"Fosfato naturale tenero 0-27-0",0,27,0]
[null,25,"FOSTATO MONOAMM MULTI MAP",12,61,0]
[null,26,"FOSTATO MONOPOT MULTI MKP",0,52,34]
[null,27,"GEOMAG MCR   0,2+5+0,5+0,5",0,0,0]
[null,28,"HUMOFOS   3/15/0 +16+8",3,15,0]
[null,29,"HUMOFOS TOP   3/15/0 +16+8",3,15,0]
[null,30,"MAGNISOL (NITR.MAGNESIO liquido) 6-0-0 +9 Mg0",6,0,0]
[null,31,"MULTI-PEPTON  Hi- Agri (FERTIRRIGAZ)",7.5,2.7E-2,0.9]
[null,32,"MULTI-UP 17/44/0 urea fosfato",17,44,0]
[null,33,"N. AMMONICO 26% PRIL",26,0,0]
[null,34,"N. AMMONICO 27%",27,0,0]
[null,35,"N. AMMONICO 27% GRAN",27,0,0]
[null,36,"N. AMMONICO 34,3%",34.299999999999997,0,0]
[null,37,"N. CALCIO ",15.5,0,0]
[null,38,"N. CALCIO MULTICAL FG (FERTIRRIGAZIO)",15.5,0,0]
[null,39,"N. CALCIO MULTICAL FG (FERTIRRIGAZIO)(DIR)",15.5,0,0]
[null,40,"N. CALCIO MULTICAL SOL (FERTIRRIGAZ)",8.5,0,0]
[null,41,"N. POT. GRAN.",13,0,46]
[null,42,"N. POT.CRIST.",13,0,46]
[null,43,"N. POT.MULTI KMG CRIST.",12,0,42]
[null,44,"N. POT.MULTI KMG GRANUL",12,0,42]
[null,45,"NATURAL N   11-0-0",11,0,0]
[null,46,"NATURAL N 8   ORG.BIOSTIMOL. 8-1-1",8,1,1]
[null,47,"NATURAL NP   ORG.MINERALE 3/12/0+21",3,12,0]
[null,48,"NATURAL TRIO 25 6-5-7",6,5,7]
[null,49,"Nitrato ammonico 26-0-0",26,0,0]
[null,50,"Nitrato ammonico 27-0-0",27,0,0]
[null,51,"Nitrato ammonico 33,5-0-0",33.5,0,0]
[null,52,"Nitrato di calcio",15.5,0,0]
[null,53,"Nitrato di Potassio 3-0-15",3,0,15]
[null,54,"Nitrato potassico 13-0-42",13,0,42]
[null,55,"Nitrato potassico 13-0-46",13,0,46]
[null,56,"Nitrato potassico-magnesiaco",12,0,43]
[null,57,"Nitrato sodico-potassico",15,0,14]
[null,58,"NP 06-40 MULTI-SEED MINI ",6,40,0]
[null,59,"NP 12-52",12,52,0]
[null,60,"NP 16-35",16,35,0]
[null,61,"NP 17-36",17,36,0]
[null,62,"NP 18/46 ",18,46,0]
[null,63,"NP 23-21",23,21,0]
[null,64,"NP 25/10/0 C ",25,10,0]
[null,65,"NP 25-10",25,10,0]
[null,66,"NP 25-13",25,13,0]
[null,67,"NP 30-10",30,10,0]
[null,68,"NP 8-40",8,40,0]
[null,69,"NPK  12 12 17s +2MgO HYDROBLU AZZURRO",12,12,17]
[null,70,"NPK 10/12/20 +2 +20 NITROPHOSKA ELITE ",10,12,20]
[null,71,"NPK 10-25-25",10,25,25]
[null,72,"NPK 11/22/16S ",11,22,16]
[null,73,"NPK 11-22-16",11,22,16]
[null,74,"NPK 12 16 18s +2MgO HYDROBLU ORO",12,16,18]
[null,75,"NPK 12/12/12           ",12,12,12]
[null,76,"NPK 12/12/17 +2 +15 MIN.NPK+MG NITROPHOSKA BLU ",12,12,17]
[null,77,"NPK 12/20/27 ",12,20,27]
[null,78,"NPK 12/27/21 ",12,27,21]
[null,79,"NPK 12-10-20",12,10,20]
[null,80,"NPK 12-12-12",12,12,12]
[null,81,"NPK 12-5-20",12,5,20]
[null,82,"NPK 12-6-18",12,6,18]
[null,83,"NPK 13/10/12",13,10,12]
[null,84,"NPK 14-10-12",14,10,12]
[null,85,"NPK 14-7-28+2 MULTI-FEED ",14,7,28]
[null,86,"NPK 15/15/15",15,15,15]
[null,87,"NPK 15/23/23",15,23,23]
[null,88,"NPK 15/5/20 +2 +20 NITROPHOSKA PERFECT ",15,5,20]
[null,89,"NPK 15/5/30",15,5,30]
[null,90,"NPK 15/9/15 +2 +16 MIN NPK NITROPHOSKA GOLD ",15,9,15]
[null,91,"NPK 15-5-20 + 20 SO3",15,5,20]
[null,92,"NPK 16-5-8",16,5,8]
[null,93,"NPK 17 9 16 +2 MULTIGRO ",17,9,16]
[null,94,"NPK 18/11/23",18,11,23]
[null,95,"NPK 20 10 10s +2MgO HYDROBLU DIAMANTE ",20,10,10]
[null,96,"NPK 20/05/10 NITROPHOSKA SUPREME  ",20,5,10]
[null,97,"NPK 20/10/10",20,10,10]
[null,98,"NPK 20-5-10+2 MULTI-FEED",20,5,10]
[null,99,"NPK 4-8-16",4,8,16]
[null,100,"NPK 5-10-15",5,10,15]
[null,101,"NPK 5-12-25",5,12,25]
[null,102,"NPK 5-14-22",5,14,22]
[null,103,"NPK 6-12-24",6,12,24]
[null,104,"NPK 6-15-10",6,15,10]
[null,105,"NPK 6-18-12",6,18,12]
[null,106,"NPK 7-14-28",7,14,28]
[null,107,"NPK 8/24/20S",8,24,20]
[null,108,"NPK 8/24/24",8,24,24]
[null,109,"NPK 8-14-18",8,14,18]
[null,110,"NPK 8-16-20",8,16,20]
[null,111,"NPK 8-24-20",8,24,20]
[null,112,"NPK 8-24-24",8,24,24]
[null,113,"NPK 8-5-28",8,5,28]
[null,114,"NUTRIGRAN TOP   12/24,5/0 +6+0,02+0,01",12,24.5,0]
[null,115,"OLIVETO  15-5-5",15,5,5]
[null,116,"ORGANOR PELLET   ",5,3,"1,5"]
[null,117,"Perfosfato concentrato 0-27-0",0,27,0]
[null,118,"Perfosfato semplice 0-19-0",0,19,0]
[null,119,"PERFOSFATO SEMPLICE GRAN. 18%",0,18,0]
[null,120,"PERFOSFATO SEMPLICE GRAN. 19%",0,19,0]
[null,121,"Perfosfato triplo 0-45-0 + microel.",0,45,0]
[null,122,"PERFOSFATO TRIPLO 46%",0,46,0]
[null,123,"PK  29-17",0,29,17]
[null,124,"PK 10-20",0,10,20]
[null,125,"PK 16/25",0,16,25]
[null,126,"PK 19-28",0,19,28]
[null,127,"Potassio Liquido 25",0,0,25]
[null,128,"Scorie potassiche 0-12-12",0,12,12]
[null,129,"Scorie Thomas",0,16,0]
[null,130,"SOLFATO AMMCO GRAN. PRATIKO 21%+66 SO3",21,0,0]
[null,131,"SOLFATO AMMCO POLV. N20% ",20,0,0]
[null,132,"Solfato ammonico 21%",21,0,0]
[null,133,"SOLFATO POT.50%GRAN. ",0,0,50]
[null,134,"SOLFATO POT.MAGN.GRAN. 30+10 ",0,0,30]
[null,135,"SOLFATO POT.MULTI SOP",0,0,51]
[null,136,"Solfato potassico , magnesio",0,0,30]
[null,137,"Solfato potassio 50%",0,0,50]
[null,138,"SUPER ROBUR    ORG.MIN.15/5/5 +26+7,5",15,5,5]
[null,139,"SUPER ROBUR \"S\"    ORG.MIN.17/5/7 +27+7,5",17,5,7]
[null,140,"UNIKO 25,5 N ",25.5,0,0]
[null,141,"Urea 46%",46,0,0]
[null,142,"UREA AGRICOLA GR.46%",46,0,0]
[null,143,"UREA AGRICOLA PRIL.46%",46,0,0]
[null,144,"Urea fosfato",18,44,0]
[null,145,"VIGNAFRUT MB    ORG.MIN.10/5/14,5+2+16",10,5,14.5]
[null,146,"VIGOR TOP 60    ORG.MIN.10/6/14",10,6,14]
[null,147]
[]
["concime","criterio"]
[null,"ID-Conc_min","Concime","N","P2O5","K2O"]
[1,17,{"$f":"VLOOKUP($B153,$B$3:$F$149,2)","v":"FERROUMATO"},{"$f":"VLOOKUP($B153,$B$3:$F$149,3)","v":5},{"$f":"VLOOKUP($B153,$B$3:$F$149,4)","v":0},{"$f":"VLOOKUP($B153,$B$3:$F$149,5)","v":0}]
[]
[null,"ID-Conc_min"]
[2,1,{"$f":"VLOOKUP($B156,$B$3:$F$149,2)","v":"Nessuno"},{"$f":"VLOOKUP($B156,$B$3:$F$149,3)","v":0},{"$f":"VLOOKUP($B156,$B$3:$F$149,4)","v":0},{"$f":"VLOOKUP($B156,$B$3:$F$149,5)","v":0}]
[]
[null,"ID-Conc_min"]
[3,1,{"$f":"VLOOKUP($B159,$B$3:$F$149,2)","v":"Nessuno"},{"$f":"VLOOKUP($B159,$B$3:$F$149,3)","v":0},{"$f":"VLOOKUP($B159,$B$3:$F$149,4)","v":0},{"$f":"VLOOKUP($B159,$B$3:$F$149,5)","v":0}]
[]
[null,"ID-Conc_min"]
[4,1,{"$f":"VLOOKUP($B162,$B$3:$F$149,2)","v":"Nessuno"},{"$f":"VLOOKUP($B162,$B$3:$F$149,3)","v":0},{"$f":"VLOOKUP($B162,$B$3:$F$149,4)","v":0},{"$f":"VLOOKUP($B162,$B$3:$F$149,5)","v":0}]
[]
[]
[]
[]
[]
[]
[]
[]
[]
[]
[]
[]
[]
[]
[]
[]
[]
[]
[]
[]
[]
[]
[]
[]
[]
[]
[]
[]
[]
[]
[]
[]
[]
[]
[]
[]
[]
[]
[]
[]
[]
[]
[]
[]
[]
[]
[]
[]
[]
[]
[]
[]
[]
[]
[]
[]
[]
[]
[]
[]
[]
[]
[]
[]
[]
[]
[]
[]
[]
[]
[]
[]
[]
[]
[]
[]
[]
[]
[]
[]
[]
[]
[]
[]
[]
[]
[]
[]
[]
[]
[]
[]
[]
[]
[]
[]
[]
[]
[]
[]
[]
[]
[]
[]
[]
[]
[]
[]
[]
[]
[]
[]
[]
[]
[]
[]
[]
[]
[]
[]
[]
[]
[]
[]
[]
[]
[]
[]
[]
[]
[]
[]
[]
[]
[]
[]
[]
[]
[]
[]
[]
[]
[]
[]
[]
[]
[]
[]
[]
[]
[]
[]
[]
[]
[]
[]
[]
[]
[]
[]
[]
[]
[]
[]
[]
[]
[]
[]
[]
[]
[]
[]
[]
[]
[]
[]
[]
[]
[]
[]
[]
[]
[]
[]
[]
[]
[]
[]
[]
[]
[]
[]
[]
[]
[]
[]
[]
[]
[]
[]
[]
[]
[]
[]
[]
[]
[]
[]
[]
[]
[]
[]
[]
[]
[]
[]
[]
[]
[]
[]
[]
[]
[]
[]
[]
[]
[]
[]
[]
[]
[]
[]
[]
[]
[]
[]
[]
[]
[]
[]
[]
[]
[]
[]
[]
[]
[]
[]
[]
[]
[]
[]
[]
[]
[]
[]
[]
[]
[]
[]
[]
[]
[]
[]
[]
[]
[]
[]
[]
[]
[]
[]
[]
[]
[]
[]
[]
[]
[]
[]
[]
[]
[]
[]
[]
[]
[]
[]
[]
[]
[]
[]
[]
[]
[]
[]
[]
[]
[]
[]
[]
[]
[]
[]
[]
[]
[]
[]
[]
[]
[]
[]
[]
[]
[]
[]
[]
[]
[]
[]
[]
[]
[]
[]
[]
[]
[]
[]
[]
[]
[]
[]
[]
[]
[]
[]
[]
[]
[]
[]
[]
[]
[]
[]
[]
[]
[]
[]
[]
[]
[]
[]
[]
[]
[]
[]
[]
[]
[]
[]
[]
[]
[]
[]
[]
[]
[]
[]
[]
[]
[]
[]
[]
[]
[]
[]
[]
[]
[]
[]
[]
[]
[]
[]
[]
[]
[]
[]
[]
[]
[]
[]
[]
[]
[]
[]
[]
[]
[]
[]
[]
[]
[]
[]
[]
[]
[]
[]
[]
[]
[]
[]
[]
[]
[]
[]
[]
[]
[]
[]
[]
[]
[]
[]
[]
[]
[]
[]
[]
[]
[]
[]
[]
[]
[]
[]
[]
[]
[]
[]
[]
[]
[]
[]
[]
[]
[]
[]
[]
[]
[]
[]
[]
[]
[]
[]
[]
[]
[]
[]
[]
[]
[]
[]
[]
[]
[]
[]
[]
[]
[]
[]
[]
[]
[]
[]
[]
[]
[]
[]
[]
[]
[]
[]
[]
[]
[]
[]
[]
[]
[]
[]
[]
[]
[]
[]
[]
[]
[]
[]
[]
[]
[]
[]
[]
[]
[]
[]
[]
[]
[]
[]
[]
[]
[]
[]
[]
[]
[]
[]
[]
[]
[]
[]
[]
[]
[]
[]
[]
[]
[]
[]
[]
[]
[]
[]
[]
[]
[]
[]
[]
[]
[]
[]
[]
[]
[]
[]
[]
[]
[]
[]
[]
[]
[]
[]
[]
[]
[]
[]
[]
[]
[]
[]
[]
[]
[]
[]
[]
[]
[]
[]
[]
[]
[]
[]
[]
[]
[]
[]
[]
[]
[]
[]
[]
[]
[]
[]
[]
[]
[]
[]
[]
[]
[]
[]
[]
[]
[]
[]
[]
[]
[]
[]
[]
[]
[]
[]
[]
[]
[]
[]
[]
[]
[]
[]
[]
[]
[]
[]
[]
[]
[]
[]
[]
[]
[]
[]
[]
[]
[]
[]
[]
[]
[]
[]
[]
[]
[]
[]
[]
[]
[]
[]
[]
[]
[]
[]
[]
[]
[]
[]
[]
[]
[]
[]
[]
[]
[]
[]
[]
[]
[]
[]
[]
[]
[]
[]
[]
[]
[]
[]
[]
[]
[]
[]
[]
[]
[]
[]
[]
[]
[]
[]
[]
[]
[]
[]
[]
[]
[]
[]
[]
[]
[]
[]
[]
[]
[]
[]
[]
[]
[]
[]
[]
[]
[]
[]
[]
[]
[]
[]
[]
[]
[]
[]
[]
[]
[]
[]
[]
[]
[]
[]
[]
[]
[]
[]
[]
[]
[]
[]
[]
[]
[]
[]
[]
[]
[]
[]
[]
[]
[]
[]
[]
[]
[]
[]
[]
[]
[]
[]
[]
[]
[]
[]
[]
[]
[]
[]
[]
[]
[]
[]
[]
[]
[]
[]
[]
[]
[]
[]
[]
[]
[]
[]
[]
[]
[]
[]
[]
[]
[]
[]
[]
[]
[]
[]
[]
[]
[]
[]
[]
[]
[]
[]
[]
[]
[]
[]
[]
[]
[]
[]
[]
[]
[]
[]
[]
[]
[]
[]
[]
[]
[]
[]
[]
[]
[]
[]
[]
[]
[]
[]
[]
[]
[]
[]
[]
[]
[]
[]
[]
[]
[]
[]
[]
[]
[]
[]
[]
[]
[]
[]
[]
[]
[]
[]
[]
[]
[]
[]
[]
[]
[]
[]
[]
[]
[]
[]
[]
[]
[]
[]
[]
[]
[]
[]
[]
[]
[]
[]
[]
[]
[]
[]
[]
[]
[]
[]
[]
[]
[]
[]
[]
[]
[]
[]
[]
[]
[]
[]
[]
[]
[]
[]
[]
[]
[]
[]
[]
[]
[]
[]
[]
[]
[]
[]
[]
[]
[]
[]
[]
[]
[]
[]
[]
[]
[]
[]
[]
[]
[]
[]
[]
[]
[]
[]
[]
[]
[]
[]
[]
[]
[]
[]
[]
[]
[]
[]
[]
[]
[]
[]
[]
[]
[]
[]
[]
[]
[]
[]
[]
[]
[]
[]
[]
[]
[]
[]
[]
[]
[]
[]
[]
[]
[]
[]
[]
[]
[]
[]
[]
[]
[]
[]
[]
[]
[]
[]
[]
[]
[]
[]
[]
[]
[]
[]
[]
[]
[]
[]
[]
[]
[]
[]
[]
[]
[]
[]
[]
[]
[]
[]
[]
[]
[]
[]
[]
[]
[]
[]
[]
[]
[]
[]
[]
[]
[]
[]
[]
[]
[]
[]
[]
[]
[]
[]
[]
[]
[]
[]
[]
[]
[]
[]
[]
[]
[]
[]
[]
[]
[]
[]
[]
[]
[]
[]
[]
[]
[]
[]
[]
[]
[]
[]
[]
[]
[]
[]
[]
[]
[]
[]
[]
[]
[]
[]
[]
[]
[]
[]
[]
[]
[]
[]
[]
[]
[]
[]
[]
[]
[]
[]
[]
[]
[]
[]
[]
[]
[]
[]
[]
[]
[]
[]
[]
[]
[]
[]
[]
[]
[]
[]
[]
[]
[]
[]
[]
[]
[]
[]
[]
[]
[]
[]
[]
[]
[]
[]
[]
[]
[]
[]
[]
[]
[]
[]
[]
[]
[]
[]
[]
[]
[]
[]
[]
[]
[]
[]
[]
[]
[]
[]
[]
[]
[]
[]
[]
[]
[]
[]
[]
[]
[]
[]
[]
[]
[]
[]
[]
[]
[]
[]
[]
[]
[]
[]
[]
[]
[]
[]
[]
[]
[]
[]
[]
[]
[]
[]
[]
[]
[]
[]
[]
[]
[]
[]
[]
[]
[]
[]
[]
[]
[]
[]
[]
[]
[]
[]
[]
[]
[]
[]
[]
[]
[]
[]
[]
[]
[]
[]
[]
[]
[]
[]
[]
[]
[]
[]
[]
[]
[]
[]
[]
[]
[]
[]
[]
[]
[]
[]
[]
[]
[]
[]
[]
[]
[]
[]
[]
[]
[]
[]
[]
[]
[]
[]
[]
[]
[]
[]
[]
[]
[]
[]
[]
[]
[]
[]
[]
[]
[]
[]
[]
[]
[]
[]
[]
[]
[]
[]
[]
[]
[]
[]
[]
[]
[]
[]
[]
[]
[]
[]
[]
[]
[]
[]
[]
[]
[]
[]
[]
[]
[]
[]
[]
[]
[]
[]
[]
[]
[]
[]
[]
[]
[]
[]
[]
[]
[]
[]
[]
[]
[]
[]
[]
[]
[]
[]
[]
[]
[]
[]
[]
[]
[]
[]
[]
[]
[]
[]
[]
[]
[]
[]
[]
[]
[]
[]
[]
[]
[]
[]
[]
[]
[]
[]
[]
[]
[]
[]
[]
[]
[]
[]
[]
[]
[]
[]
[]
[]
[]
[]
[]
[]
[]
[]
[]
[]
[]
[]
[]
[]
[]
[]
[]
[]
[]
[]
[]
[]
[]
[]
[]
[]
[]
[]
[]
[]
[]
[]
[]
[]
[]
[]
[]
[]
[]
[]
[]
[]
[]
[]
[]
[]
[null,115]

{"sheet":"Mod_distribuz","index":19,"n_rows":24,"n_cols":14,"rows_kept":24,"cut":false,"hidden":true,"merged":[]}
["Modalità di distribuzione dfei fertilizzanti in relazione alla coltura e all'epoca",null,null,null,null,null,null,null,null,"Dose distribuzione N organico"]
[null,"ID_Mo","Modalità_Epoca",null,null,null,null,null,null,"valore","ID_N_Org","da","a","Dose"]
[null,1,"Su terreno nudo  e semina nell'anno successivo",null,null,null,null,null,null,0,1,0,124,"bassa"]
[null,2,"Su residui pagliosi e semina nell'anno successivo",null,null,null,null,null,null,125,2,125,249,"media"]
[null,3,"Alla preparazione del terreno e semina nel medesimo anno",null,null,null,null,null,null,250,3,250,1000,"alta"]
[null,4,"In copertura con fertirrigazione"]
[null,5,"In copertura con fertirrigazione a bassa pressione",null,null,null,null,null,"Fert. 1",{"$f":"Distribuz!N7","v":0},{"$f":"VLOOKUP($J7,$J$2:$M$5,2)","v":1},{"$f":"VLOOKUP($J7,$J$2:$M$5,3)","v":0},{"$f":"VLOOKUP($J7,$J$2:$M$5,4)","v":124},{"$f":"VLOOKUP($J7,$J$2:$N$5,5)","v":"bassa"}]
[null,6,"In copertura con interramento"]
[null,7,"In copertura in primavera senza interramento",null,null,null,null,null,"Fert. 2",{"$f":"Distribuz!N10","v":0},{"$f":"VLOOKUP($J9,$J$2:$M$5,2)","v":1},{"$f":"VLOOKUP($J9,$J$2:$M$5,3)","v":0},{"$f":"VLOOKUP($J9,$J$2:$M$5,4)","v":124},{"$f":"VLOOKUP($J9,$J$2:$N$5,5)","v":"bassa"}]
[null,8,"In copertura in estate senza interramento"]
[null,9,"Su residui pagliosi e semina nel medesimo anno ",null,null,null,null,null,"Fert. 3",{"$f":"Distribuz!N13","v":0},{"$f":"VLOOKUP($J11,$J$2:$M$5,2)","v":1},{"$f":"VLOOKUP($J11,$J$2:$M$5,3)","v":0},{"$f":"VLOOKUP($J11,$J$2:$M$5,4)","v":124},{"$f":"VLOOKUP($J11,$J$2:$N$5,5)","v":"bassa"}]
[null,10,"Presemina"]
[null,11,"In copertura nella fase di pieno accestimento (fine inverno)"]
[null,12,"In copertura nella fase di levata"]
[null,13,"Ripresa vegetativa e tagli primaverili"]
[null,14,"Tagli estivi o autunno precoci (< 15/10)"]
[null,15,"Tardo autunno (>15/10)"]
[null,16,"Preimpianto distante dalla crescita"]
[null,17,"Preimpianto vicino alla crescita"]
[null,18,"In primavera su frutteto inerbito o con interramento"]
[null,19,"In estate o fine inverno su frutteto inerbito o con interramento"]
[null,20,"In primavera su frutteto lavorato senza interramento"]
[null,21,"In estate autunno su frutteto lavorato senza interramento"]
[null,22,"Prima o durante il rapido accrescimento"]

{"sheet":"Cicli","index":20,"n_rows":8,"n_cols":10,"rows_kept":8,"cut":false,"hidden":true,"merged":[]}
["Ciclo delle colture"]
[null,"ID_Cic","ciclo","esempio","durata(*)",null,null,null,"ID Dur"]
[null,1,"autunno - vernino","frumento tenero","m",null,null,null,"i","indefinita"]
[null,2,"intercalare","soia semina in giugno","m",null,null,null,"m","meno di un anno"]
[null,3,"pluriennale arboree","melo, pesco, vite","p",null,null,null,"p","più di un anno"]
[null,4,"pluriennale erbacee","prati","p"]
[null,5,"primaverile - estivo","mais","m"]
[null,6,"indefinito","erbaio","i"]

{"sheet":"Suolo","index":21,"n_rows":27,"n_cols":7,"rows_kept":27,"cut":false,"hidden":true,"merged":[]}
["Seleziona il suolo"]
["Legenda","ID_Suo","Descrizione","Classe","ID_Rag","Raggruppamento","Gruppo"]
[1,"S","Sabbioso","Grossolana",1,"Sabbiosi","tendenzialmente sabbioso"]
[2,"SF","Sabbioso Franco","Grossolana",1,"Sabbiosi","tendenzialmente sabbioso"]
[3,"L","Limoso","Media",2,"Medio impasto","franco"]
[4,"FS","Franco Sabbioso","Media",1,"Sabbiosi","tendenzialmente sabbioso"]
[5,"F","Franco","Media",2,"Medio impasto","franco"]
[6,"FL","Franco Limoso","Media",2,"Medio impasto","franco"]
[7,"FSA","Franco Sabbioso Argilloso","Media",2,"Medio impasto","franco"]
[8,"FA","Franco Argilloso","Media",2,"Medio impasto","franco"]
[9,"FLA","Franco Limoso Argilloso","Media",3,"Argillosi e limosi","tendenzialmente argilloso"]
[10,"AS","Argilloso Sabbioso","Fine",3,"Argillosi e limosi","tendenzialmente argilloso"]
[11,"AL","Argilloso Limoso","Fine",3,"Argillosi e limosi","tendenzialmente argilloso"]
[12,"A","Argilloso","Fine",3,"Argillosi e limosi","tendenzialmente argilloso"]
[]
[1,{"$f":"(A16+1)","v":2},3,4,5,6,7]
["Criterio"]
["Legenda","ID_Suo","Descrizione","Classe","ID_Rag","Raggruppamento","Gruppo"]
[{"$f":"E26","v":9},{"$f":"E27","v":"FLA"},{"$f":"DGET($A$2:$G$14,C16,$A$18:$B$19)","v":"Franco Limoso Argilloso"},{"$f":"DGET($A$2:$G$14,D16,$A$18:$B$19)","v":"Media"},{"$f":"DGET($A$2:$G$14,E16,$A$18:$B$19)","v":3},{"$f":"DGET($A$2:$G$14,F16,$A$18:$B$19)","v":"Argillosi e limosi"},{"$f":"DGET($A$2:$G$14,G16,$A$18:$B$19)","v":"tendenzialmente argilloso"}]
[]
["foglio","valore","variabile","TRI","Foglio","Matrice"]
["inserimento","intero",null,null,"n°","n°"]
["C13",{"$f":"INT(Inserimento!C21)","v":35},"% di argilla","riga",{"$f":"(103-(B23))","v":68},{"$f":"(101-B23)","v":66}]
["C11",{"$f":"INT(Inserimento!C19)","v":10},"% di sabbia","colonna",{"$f":"(B24+4)","v":14},{"$f":"(B24+1)","v":11}]
[]
[null,null,null,"TRI2",{"$f":"INDEX('TRI2'!D3:CZ103,Suolo!F23,Suolo!F24)","v":9}]
[null,null,null,"TRI3",{"$f":"INDEX('TRI3'!D3:CZ103,Suolo!F23,Suolo!F24)","v":"FLA"}]

{"sheet":"Ragg_Tes","index":22,"n_rows":9,"n_cols":8,"rows_kept":9,"cut":false,"hidden":true,"merged":[]}
["Ragguppamento Tessitura","ID_Rag","Peso_ specifico","fattore di immobilizzazione di P (a)","Peso_di_20_cm","Peso_di_30_cm","Peso_di_40_cm","Peso_di_50_cm"]
["Argilloso",3,1.2,1.4,{"$f":"(2000*C2)","v":2400},{"$f":"(C2*3000)","v":3600},{"$f":"(C2*4000)","v":4800},{"$f":"(C2*5000)","v":6000}]
["Sabbioso",1,1.4,1.2,{"$f":"(2000*C3)","v":2800},{"$f":"(C3*3000)","v":4200},{"$f":"(C3*4000)","v":5600},{"$f":"(C3*5000)","v":7000}]
["Franco",2,1.3,1.3,{"$f":"(2000*C4)","v":2600},{"$f":"(C4*3000)","v":3900},{"$f":"(C4*4000)","v":5200},{"$f":"(C4*5000)","v":6500}]
[]
[1,{"$f":"(A6+1)","v":2},3,4,5,6,7,8]
[null,"Criterio"]
["Tessitura","ID_Rag","Peso_ specifico","fattore di immobilizzazione di P (a)","Peso_di_20_cm","Peso_di_30_cm","Peso_di_40_cm","Peso_di_50_cm"]
[{"$f":"DGET($A$1:$H$4,A6,$B$8:$B$9)","v":"Argilloso"},{"$f":"Codici!S2","v":3},{"$f":"DGET($A$1:$H$4,C6,$B$8:$B$9)","v":1.2},1.4,2400,3600,4800,6000]

{"sheet":"CN","index":23,"n_rows":10,"n_cols":5,"rows_kept":10,"cut":false,"hidden":true,"merged":[]}
["DI_CN","min","max","classe CN"]
[1,0,9,"basso"]
[2,9,12,"equilibrato"]
[3,12,100,"alto"]
[null,"Criterio"]
["DI_CN","min","max","classe CN","Valore"]
[{"$f":"DGET(A1:D4,A1,D6:D7)","v":2},{"$f":"CONCATENATE(B9,LEFT($E$7,4))","v":"<9,66"},{"$f":"CONCATENATE(C9,LEFT($E$7,4))","v":">9,66"},{"$f":"DGET($A$1:$D$4,D1,B6:C8)","v":"equilibrato"},{"$f":"Inserimento!L23","v":9.6674400618716163}]
[null,{"$f":"CONCATENATE(B10,LEFT($E$7,4))","v":"=9,66"}]
[null,"<",">"]
[null,"="]

{"sheet":"B","index":24,"n_rows":29,"n_cols":16,"rows_kept":29,"cut":false,"hidden":true,"merged":[[1,14,1,15]]}
["B (kg/ha):   Apporti di azoto derivanti dalla fertilità del suolo ."]
["Dotazione di SO (%)",null,null,null,null,"Raggruppamento","Dbase",null,null,"ID_Min","ID_Rag","ID_CN","Coeff_min",null,"Detrazione per semina su sodo"]
["ID_SO","Raggruppamento","min ","max","Dotazione","Sabbiosi","C4:E7",null,null,1,1,1,3]
[1,"Sabbiosi",0,0.8,"molto bassa","Medio impasto","C8:E11",null,null,2,2,1,2,null,"Sodo",{"$f":"Codici!AZ2","v":false}]
[2,"Sabbiosi",0.8,1.4,"bassa","Argillosi e limosi","C12:E15",null,null,3,3,1,1.5,null,"Coltura",{"$f":"Coltura!I225","v":false}]
[3,"Sabbiosi",1.4,2,"media","Criterio",null,null,null,4,1,2,2.5]
[4,"Sabbiosi",2,99,"elevata","Raggruppamento","Dbase",null,null,5,2,2,1.85,null,"Detrazione",{"$f":"IF(AND(P4=TRUE,P5=TRUE),10,0)","v":0}]
[5,"Medio impasto",0,1,"molto bassa",{"$f":"Suolo!F19","v":"Argillosi e limosi"},{"$f":"DGET(F2:G5,G2,F7:F8)","v":"C12:E15"},null,null,6,3,2,1]
[6,"Medio impasto",1,1.8,"bassa",null,null,null,null,7,1,3,2]
[7,"Medio impasto",1.8,2.5,"media","Intervallo normalità",null,null,null,8,2,3,1.7]
[8,"Medio impasto",2.5,99,"elevata","minimo","massimo",null,null,9,3,3,0.5]
[9,"Argillosi e limosi",0,1.2,"molto bassa",{"$f":"DGET($A$3:$E$15,C$3,$F$14:$G$15)","v":2.2000000000000002},{"$f":"DGET($A$3:$E$15,D$3,$F$14:$G$15)","v":3}]
[10,"Argillosi e limosi",1.2,2.2000000000000002,"bassa","Criteri",null,null,null,null,"Criterio"]
[11,"Argillosi e limosi",2.2000000000000002,3,"media","Raggruppamento","Dotazione",null,null,"ID_Min","ID_Rag","ID_CN","Coeff_min"]
[12,"Argillosi e limosi",3,99,"elevata",{"$f":"Suolo!F19","v":"Argillosi e limosi"},"media",null,null,{"$f":"DGET($J$2:$M$11,J2,$K$14:$L$15)","v":6},{"$f":"Codici!S2","v":3},{"$f":"Codici!AC2","v":2},{"$f":"DGET($J$2:$M$11,M2,$K$14:$L$15)","v":1}]
[null,"criteri x ricerca ID_SO",null,null,null,null,null,null,null,null,null,null,null,"da SO","pronto"]
[null,null,"Cercati in vert. Con inserito",null,null,null,"S.O. (%)","N tot (g/kg)",null,"Peso di 20 cm",null,null,null,"b2","b1","B"]
["ID_SO","Raggruppamento","min ","max","Dotazione","Inserito",{"$f":"Codici!Z2","v":1.5},{"$f":"Codici!Y2","v":0.9},null,"t/ha","S.O. t/ha","N tot. t/ha","Nm kg/ha","Nm utile  kg/ha","Np kg/ha","kg/ha"]
[{"$f":"DGET(A3:E15,1,B18:E19)","v":10},{"$f":"Suolo!F19","v":"Argillosi e limosi"},{"$f":"VLOOKUP($G$18,INDIRECT($G$8),1)","v":1.2},{"$f":"VLOOKUP($G$18,INDIRECT($G$8),2)","v":2.2000000000000002},{"$f":"VLOOKUP($G18,INDIRECT(G8),3)","v":"bassa"},"Utilizzato",{"$f":"IF(G18>3,3,G18)","v":1.5},{"$f":"IF(H18>2.1,2.1,H18)","v":0.9},null,{"$f":"Ragg_Tes!E9","v":2400},{"$f":"(J19*G18/100)","v":36},{"$f":"((J19*H18/1000))","v":2.16},{"$f":"((((J19*G19/100)*1000)*M15/100)*0.05)","v":18},{"$f":"M19*Codici!O2","v":9},{"$f":"((J19*H19/1000)*1000)*0.01","v":21.6},{"$f":"IF(Codici!O2<1,N19+O19-P7,N19)","v":30.6}]
[]
[null,null,"Dotazione di Azoto Totale (g/kg)"]
[null,"Univ. Torino","ID_N_tot","min","max","Dotazione"]
[null," <0,5",1,0,0.5,"Molto bassa",null,"Criterio",null,"Valore"]
[null,">= 0,5 - <1,0",2,0.5,1,"Bassa",null,"min","max","inserito"]
[null,">= 1,0 - <2,0",3,1,2,"Media",null,{"$f":"CONCATENATE(H27,LEFT($J$25,4))","v":"<0,9"},{"$f":"CONCATENATE(I27,LEFT($J$25,4))","v":">0,9"},{"$f":"Codici!Y2","v":0.9}]
[null,">= 2,0 - <2,5",4,2,2.5,"Elevata",null,{"$f":"CONCATENATE(H28,LEFT($J$25,4))","v":"=0,9"}]
[null,">= 2,5",5,2.5,99,"Molto elevata",null,"<",">"]
[null,null,null,null,null,null,null,"="]
[null,null,{"$f":"DGET($C$22:$F$27,1,$H$24:$I$26)","v":2},{"$f":"DGET($C$22:$F$27,2,$H$24:$I$26)","v":0.5},{"$f":"DGET($C$22:$F$27,3,$H$24:$I$26)","v":1},{"$f":"DGET($C$22:$F$27,4,$H$24:$I$26)","v":"Bassa"}]

{"sheet":"C&D","index":25,"n_rows":35,"n_cols":11,"rows_kept":35,"cut":false,"hidden":true,"merged":[[33,0,33,1],[33,2,33,4],[31,0,31,1],[20,0,20,1],[19,0,19,1],[18,0,18,1],[23,0,23,1],[21,0,21,1],[29,0,29,1],[30,0,30,1],[24,0,24,1]]}
["Perdite per lisciviazione  (C),  immobilizzazione e dispersione (D) e effetto negativo precessione (- E)"]
[null,null,null,null,null,"coefficienti, parametri e valori"]
["Disponibilità d'ossigeno",null,null,null,null,"ID_C&D","ID_Rag","ID_Dre","C","fc_D"]
["ID_Dre","Disponibilità",null,null,null,1,1,1,30,0.35]
[1,"Imperfetta",null,null,null,2,1,2,40,0.2]
[2,"Moderata",null,null,null,3,1,3,50,0.15]
[3,"Buona",null,null,null,4,2,1,20,0.4]
[null,null,null,null,null,5,2,2,30,0.25]
["Criterio",null,null,null,null,6,2,3,40,0.2]
["ID_Dre","Disponibilità",null,null,null,7,3,1,10,0.45]
[{"$f":"Codici!AM2","v":1},{"$f":"DGET(A4:B7,2,A10:A11)","v":"Imperfetta"},null,null,null,8,3,2,20,0.3]
[null,null,null,null,null,9,3,3,30,0.25]
["C (kg/ha)  : Perdite per lisciviazione",null,null,null,null,null,"Criteri"]
["Ca = perdite nella stagione autunno invernale",null,null,null,null,null,"ID_Rag","ID_Dre"]
[null,"in base alla facilità del drenaggio",null,{"$f":"DGET($F$3:$J$12,4,$G$14:$H$15)","v":10},null,null,{"$f":"Codici!S2","v":3},{"$f":"Codici!AM2","v":1}]
[]
[null,"in base alle precipitazioni",null,null,null,{"$f":"DGET($F$3:$J$12,1,$G$14:$H$15)","v":7},null,null,null,{"$f":"DGET($F$3:$J$12,5,$G$14:$H$15)","v":0.45}]
["Pioggia nel periodo invernale",null,null,{"$f":"Inserimento!B37","v":225.6}]
["Pioggia mancante per perdita completa",null,null,{"$f":"(250-D18)","v":24.400000000000006},null,"D (kg/ha) : Perdite immobilizz. e dispersione",null,null,null,null,{"$f":"(B!P19)*J17","v":13.770000000000001}]
["N pronto potenzialmente lisciviabile (kg/ha)",null,{"$f":"IF(Codici!O2<1,B!O19,30)","v":21.6}]
["x percentuale di perdita (%)",null,{"$f":"IF((-150+Inserimento!B37)<0,0,IF((-150+Inserimento!B37)>100,100,(-150+Inserimento!B37)))","v":75.599999999999994},null,null,"E (kg/ha)",{"$f":"E!C28","v":-10},null,"da conteggiare",null,{"$f":"IF(AND(G21<0,C_tempo!D22=\"sì\"),G21,0)","v":-10}]
["Perdite di N pronto con le piogge invernali",null,{"$f":"IF(OR($C$23=TRUE,Codici!$H$2=1),0,(C20*C21/100))","v":16.329599999999999}]
["In serra",null,{"$f":"Codici!I2","v":2},null,null,"D +(- E)",{"$f":"IF(K21<0,(K21*-1)+'C&D'!K19,'C&D'!K19)","v":23.770000000000003}]
["Perdite di N pronto per piogge tardive (kg/ha)",null,{"$f":"IF(D30>0,(C20-C22),0)","v":5.2704000000000022}]
["Perdite di N pronto complessive kg/ha",null,{"$f":"(C22+C24)","v":21.6}]
[]
["Cb = perdite all'uscita dall'inverno"]
["Condizioni: ","precipitazioni invernali > 150 mm",null,{"$f":"IF(Inserimento!B37>150,TRUE,FALSE)","v":true}]
[null,"Precipitazioni a febbraio:",{"$f":"Inserimento!E37","v":40}]
["Rimanenza piogge per  perdite febbraio",null,null,{"$f":"(Inserimento!E37-'C&D'!D19)","v":15.599999999999994}]
["Quantità di N lisciviabile (kg/ha)",null,{"$f":"(D30/10)","v":1.5599999999999994}]
["Perdite da conteggiare in febbraio",null,{"$f":"IF(AND(D28=TRUE,C31>0),C31,0)","v":1.5599999999999994}]
[]
["Fattore incremento nelle schede a dose standard:",null,"Lisciviazione x surplus pluviometrico"]
[null,"Condizione: poiggia dal 1/10 al 28/2 >= 300 mmm",null,{"$f":"IF((D18+C29)>299,TRUE,FALSE)","v":false}]

{"sheet":"E","index":26,"n_rows":30,"n_cols":7,"rows_kept":30,"cut":false,"hidden":true,"merged":[]}
["E (kg/ha):  fertilità residua della precessione"]
["ID_Pre","Precessione","N","Leguminosa"]
[1,"Barbabietola",30,false]
[2,"Cereale autunno-vern. Paglia asportata",-10,false]
[3,"Cereale autunno-vern. Paglia interrata",-30,false]
[4,"Colza",20,false]
[5,"Girasole",0,false]
[6,"Mais stocchi asportati",-10,false]
[7,"Mais stocchi interrati",-40,false]
[8,"Medicaio diradato",60,true]
[9,"Medicaio in buone conndizioni",80,true]
[10,"Orticole a foglia",25,false]
[11,"Patata",35,false]
[12,"Pomodoro e altre orticole",30,false,null,null,"es. cucurbitacee, crucifere e liliacee"]
[13,"Prato di breve durata o trifoglio",30,true]
[14,"Prato polifita con leguminose < 5%",15,false]
[15,"Prato polifita con leguminose > 15%",60,true]
[16,"Prato polifita con leguminose dal 5 al 15%",40,true]
[17,"Soia",10,true]
[18,"Sorgo",-40,false]
[19,"Sovescio di leguminose",50,true]
[20,"Leguminosa da granella (Pisello, Fagiolo, Cece, ecc.)",40,true]
[21,"Non definita",0,false]
[]
["Criterio"]
["ID_Pre",null,null,null,"Fertilità residua positiva (*)"]
[{"$f":"Codici!AO2","v":2},null,null,null,null," + E"]
[null,{"$f":"DGET($A$2:$C$23,2,$A$26:$A$27)","v":"Cereale autunno-vern. Paglia asportata"},{"$f":"DGET($A$2:$C$23,3,$A$26:$A$27)","v":-10},{"$f":"DGET($A$2:$D$23,4,$A$26:$A$27)","v":false},null,{"$f":"IF(AND(C_tempo!D22=\"sì\",C28>0),C28,0)","v":0}]
[]
[" *)  se negativa vedi scheda \"C&D\""]

{"sheet":"F","index":27,"n_rows":14,"n_cols":13,"rows_kept":14,"cut":false,"hidden":true,"merged":[]}
["F (kg/ha): N da fertilizzazioni organiche effettuate negli anni precedenti alle colture in precessione"]
["Coefficienti di recupero",null,null,null,null,null,null,"ID_Fre","campo","Frequenza"]
["ID_MO","Matrice organica","tutti gli anni","ogni 2","ogni 3","saltuaria",null,1,3,"tutti gli anni"]
[1,"Ammendante",0.5,0.3,0.2,0.2,null,2,4,"ogni 2 anni"]
[2,"Liquame bovino/digestato",0.3,0.15,0.1,0,null,3,5,"ogni 3 anni"]
[3,"Liquame suino e/o pollina",0.15,0.1,0.05,0,null,4,6,"saltuario"]
[4,"Nessuno",0,0,0,0]
[null,null,null,null,null,null,null,"Criterio"]
["Criterio",null,null,null,null,null,null,"ID_Fre"]
["ID_MO",null,null,null,null,null,null,{"$f":"Codici!AR2","v":1},{"$f":"DGET($H$2:$J$6,2,$H$9:$H$10)","v":3},{"$f":"DGET($H$2:$J$6,3,$H$9:$H$10)","v":"tutti gli anni"}]
[{"$f":"Codici!AP2","v":1},null,null,null,null,null,null,null,null,null,null,null,"F"]
[null,null,null,"campi",null,null,null,null,null,"Coefficiente","Quantità","Disponibilità"]
[1,{"$f":"(A13+1)","v":2},{"$f":"(B13+1)","v":3},{"$f":"(C13+1)","v":4},{"$f":"(D13+1)","v":5},{"$f":"(E13+1)","v":6},null,"ricerca orrizz. ",null,"recupero","kg/ha","annua","effettiva"]
[null,{"$f":"DGET($A$3:$F$7,B13,$A$10:$A$11)","v":"Ammendante"},{"$f":"DGET($A$3:$F$7,C13,$A$10:$A$11)","v":0.5},{"$f":"DGET($A$3:$F$7,D13,$A$10:$A$11)","v":0.3},{"$f":"DGET($A$3:$F$7,E13,$A$10:$A$11)","v":0.2},{"$f":"DGET($A$3:$F$7,F13,$A$10:$A$11)","v":0.2},null,"il campo",null,{"$f":"HLOOKUP(I10,C13:F14,2)","v":0.5},{"$f":"Codici!AS2","v":0},{"$f":"(J14*K14)","v":0},{"$f":"(L14*C_tempo!C22)","v":0}]

{"sheet":"Fert_org","index":28,"n_rows":31,"n_cols":21,"rows_kept":31,"cut":false,"hidden":true,"merged":[]}
["Caratteristiche di alcuni Fertilizzanti organici"]
[]
[null,"ID_F_org","fertilizzante","ID_Sett","tipo","min_ss","max_ss","media_ss","min_N","max_N","media_N","min_P2O5","max_P2O5","media_P2O5","min_K2O","max_K2O","media_K2O"," 100% zootec","Incremento SO","ID_Sett","settore"]
[null,1,"compost","ind",3,65,65,65,12,12,12,9,9,9,10,10,10,"no",1,"avi","avicolo"]
[null,{"$f":"(B4+1)","v":2},"Digestato t.q. biomasse o con effl. bovini","dig_tq",7,20,24,{"$f":"AVERAGE(F5:G5)","v":22},3,9,{"$f":"AVERAGE(I5:J5)","v":6},4,4,{"$f":"AVERAGE(L5:M5)","v":4},4,10,{"$f":"AVERAGE(O5:P5)","v":7},"no",0,"bov","bovino"]
[null,{"$f":"(B5+1)","v":3},"Digestato t.q. con prevalenza effl. Suini","dig_sui",7,20,24,{"$f":"AVERAGE(F6:G6)","v":22},3,9,{"$f":"AVERAGE(I6:J6)","v":6},4,4,{"$f":"AVERAGE(L6:M6)","v":4},4,10,{"$f":"AVERAGE(O6:P6)","v":7},"no",0,"sui","suino"]
[null,4,"Digestato t.q. con prevalenza di effl. avicoli","dig_avi",7,20,24,{"$f":"AVERAGE(F7:G7)","v":22},3,9,{"$f":"AVERAGE(I7:J7)","v":6},4,4,{"$f":"AVERAGE(L7:M7)","v":4},4,10,{"$f":"AVERAGE(O7:P7)","v":7},"no",0,"com","commerciale"]
[null,5,"Digestato frazione chiarificata","dig_chi",7,2,6,{"$f":"AVERAGE(F8:G8)","v":4},6,10,{"$f":"AVERAGE(I8:J8)","v":8},3,3,{"$f":"AVERAGE(L8:M8)","v":3},4,10,{"$f":"AVERAGE(O8:P8)","v":7},"no",0,"dig-tq","digestato derivante da biomasse da sole o in miscela con effluenti bovini"]
[null,6,"Digestato frazione palabile","dig_pal",2,30,40,{"$f":"AVERAGE(F9:G9)","v":35},2,8,{"$f":"AVERAGE(I9:J9)","v":5},5,5,{"$f":"AVERAGE(L9:M9)","v":5},4,10,{"$f":"AVERAGE(O9:P9)","v":7},"no",1,"dig_sui","digestato derivante da biomasse con presenza di effluenti suini per più del 50%"]
[null,7,"humofort pellet amm. Org. Nat.","com",3,65,65,65,18,18,18,10,10,10,10,10,10,"no",1,"dig_avi","digestato derivante da biomasse con presenza di effluenti avicoli per più del 50%"]
[null,8,"ammendante compostato misto","com",3,60,70,{"$f":"AVERAGE(F11:G11)","v":65},16,20,{"$f":"AVERAGE(I11:J11)","v":18},10,14,{"$f":"AVERAGE(L11:M11)","v":12},12,14,{"$f":"AVERAGE(O11:P11)","v":13},"no",1,"dig_chi","frazione liquida del digestato di qualsiasi matrice sottoposto a separazione"]
[null,9,"humoscam pellet amm. Veg. Fermentato","com",3,65,65,65,20,20,20,30,30,30,16,16,16,"no",1,"dig_pal","digestato di qualsiasi matrice sottoposto a separazione"]
[null,10,"letame bovino","bov",2,20,30,25,3,7,5,0.9,3.9,{"$f":"AVERAGE(L13:M13)","v":2.4},4,10,{"$f":"AVERAGE(O13:P13)","v":7},"sì",1,"fan","fanghi"]
[null,11,"letame ovino","avi",2,22,40,31,6,11,8.5,1.6,3,{"$f":"AVERAGE(L14:M14)","v":2.2999999999999998},14,21.6,{"$f":"AVERAGE(O14:P14)","v":17.8},"sì",1,"ind","indefinito"]
[null,12,"letame suino","sui",2,25,25,25,4.7,4.7,4.7,4.0999999999999996,4.0999999999999996,4.0999999999999996,5.4,5.4,5.4,"sì",1,"nn","nessuno"]
[null,13,"lettiera esausta polli da carne","avi",4,60,80,70,30,47,38.5,29.77,57.25,{"$f":"AVERAGE(L16:M16)","v":43.51},16.8,20.399999999999999,{"$f":"AVERAGE(O16:P16)","v":18.600000000000001},"sì",1]
[null,14,"liquame bovini da carne","bov",6,7,10,8.5,3.2,4.5,{"$f":"AVERAGE(I17:J17)","v":3.85},2.2999999999999998,3.4,{"$f":"AVERAGE(L17:M17)","v":2.8499999999999996},2.9,4.7,{"$f":"AVERAGE(O17:P17)","v":3.8},"sì",0]
[null,15,"liquame bovini da latte","bov",6,10,16,13,3.9,6.3,{"$f":"AVERAGE(I18:J18)","v":5.0999999999999996},2.2999999999999998,3.7,{"$f":"AVERAGE(L18:M18)","v":3},3.8,6.2,{"$f":"AVERAGE(O18:P18)","v":5},"sì",0]
[null,16,"liquami ovaiole","avi",6,19,25,22,10,15,12.5,9.1999999999999993,11.5,{"$f":"AVERAGE(L19:M19)","v":10.35},3.6,9,{"$f":"AVERAGE(O19:P19)","v":6.3},"sì",0]
[null,17,"liquami suini","sui",6,1.5,6,{"$f":"AVERAGE(F20:G20)","v":3.75},1.5,5,{"$f":"AVERAGE(I20:J20)","v":3.25},1.1000000000000001,4.5999999999999996,{"$f":"AVERAGE(L20:M20)","v":2.8499999999999996},1.2,3.7,{"$f":"AVERAGE(O20:P20)","v":2.4500000000000002},"sì",0]
[null,18,"pollina preessicata","avi",8,50,85,67.5,23,43,33,21,34,27.5,17,30,23.5,"sì",0]
[null,19,"fanghi agroalimentari","fan",5,20,30,25,1.4,4.2,{"$f":"AVERAGE(I22:J22)","v":2.8},1.25,3.75,{"$f":"AVERAGE(L22:M22)","v":2.5},2,5,{"$f":"AVERAGE(O22:P22)","v":3.5},"no",0]
[null,20,"tioscam 50 amm. Base ferro e zolfo","com",3,65,65,65,10,10,10,0,0.9,0.45,0,0.9,0.45,"no",1]
[null,21,"z nessuno","nn",1,0,0,0,0,0,0,0,0,0,0,0,0,"sì",0]
[null,"Criterio",2,3,4,5,6,7,8,9,10,11,12,13,14,15,16,17,18]
[null,"ID_F_org"]
["Fert. 1",10,{"$f":"DGET($B$3:$Q$24,C25,$B$26:$B$27)","v":"letame bovino"},{"$f":"DGET($B$3:$Q$24,D25,$B$26:$B$27)","v":"bov"},2,20,30,25,3,7,5,0.9,3.9,2.4,4,10,7,{"$f":"DGET($B$3:$R$24,R25,$B$26:$B$27)","v":"sì"},{"$f":"DGET($B$3:$S$24,S25,$B$26:$B$27)","v":1}]
[null,"ID_F_org"]
["Fert. 2",14,{"$f":"DGET($B$3:$Q$24,C25,$B28:$B29)","v":"liquame bovini da carne"},{"$f":"DGET($B$3:$Q$24,D25,$B28:$B29)","v":"bov"},6,7,10,8.5,3.2,4.5,3.85,2.2999999999999998,3.4,2.8499999999999996,2.9,4.7,3.8,{"$f":"DGET($B$3:$R$24,R25,$B28:$B29)","v":"sì"},{"$f":"DGET($B$3:$S$24,S25,$B$28:$B$29)","v":0}]
[null,"ID_F_org"]
["Fert. 3",21,{"$f":"DGET($B$3:$R$24,C25,$B30:$B31)","v":"z nessuno"},{"$f":"DGET($B$3:$R$24,D25,$B30:$B31)","v":"nn"},1,0,0,0,0,0,0,0,0,0,0,0,0,"sì",{"$f":"DGET($B$3:$S$24,S25,$B$30:$B$31)","v":0}]

{"sheet":"G","index":29,"n_rows":20,"n_cols":5,"rows_kept":20,"cut":false,"hidden":true,"merged":[]}
["G (kg/ha):  N da apporti naturali"]
[null,null,"Deposizione"]
["ID_UBI","Ubicazione","annua"]
[1,"Pianura limitrofa a zone urbanizzate",20]
[2,"Pianura isolata",15]
[3,"Collina o montagna",10]
[]
["Criterio"]
["ID_UBI"]
[{"$f":"Codici!AU2","v":2}]
[null,{"$f":"DGET($A$3:$C$6,2,$A$9:$A$10)","v":"Pianura isolata"},{"$f":"DGET($A$3:$C$6,3,$A$9:$A$10)","v":15}]
[]
["Deposizioni atmosferiche utile alla coltura",null,null,{"$f":"IF(Codici!I2=TRUE,0,(C11*Codici!O2))","v":7.5}]
["Assorbimento coltura",null,null,null,{"$f":"A!D231","v":111.19999999999999}]
["Bilancio al netto dell'azoto fissazione",null,null,null,{"$f":"(Bilancio!H15+Bilancio!H16+Bilancio!H19-Bilancio!H25-Bilancio!H26-Bilancio!H27-D13)","v":120.03}]
[]
["Azoto fissazione",null,null,{"$f":"IF(AND(E15>0,Coltura!E225>0),(E14*Codici!AT2)/100,0)","v":0}]
[]
[null,null,null,"G"]
["Totale apporti naturali",null,null,{"$f":"(D13+D17)","v":7.5}]

{"sheet":"Efficienza","index":30,"n_rows":227,"n_cols":18,"rows_kept":227,"cut":false,"hidden":true,"merged":[[21,17,23,17],[24,17,26,17],[18,17,20,17],[3,17,5,17],[6,17,8,17],[9,17,11,17],[12,17,14,17],[15,17,17,17]]}
["Selezione Valori efficienza",null,null,null,null,null,null,null,"Tabella per creazione valori efficienza"]
[null,"suolo","livello","settore","dose",null,null,null,null,"Sabbioso",null,null,"Franco",null,null,"Argilloso"]
[null,"ID_Rag","ID_Liv","ID_Sett","ID_N_org","Efficienza",null,"dose","bassa","media","alta","bassa","media","alta","bassa","media","alta"]
[null,1,3,"avi",1,{"$f":"I$4","v":90.85},null,null,{"$f":"(I10*1.15)","v":90.85},{"$f":"(J10*1.15)","v":83.949999999999989},77.05,81.649999999999991,74.75,66.699999999999989,72.449999999999989,65.55,57.499999999999993,"avi"]
[null,1,2,"avi",1,{"$f":"I$5","v":65.55},null,null,{"$f":"(I11*1.15)","v":65.55},60.949999999999996,55.199999999999996,59.8,55.199999999999996,49.449999999999996,52.9,48.3,43.699999999999996]
[null,1,1,"avi",1,{"$f":"I$6","v":40.25},null,null,40.25,37.949999999999996,33.349999999999994,37.949999999999996,35.65,32.199999999999996,33.349999999999994,32.199999999999996,28.749999999999996]
[null,1,3,"bov",1,{"$f":"I$7","v":67.149999999999991},null,null,{"$f":"(I10*0.85)","v":67.149999999999991},{"$f":"(J10*0.85)","v":62.05},56.949999999999996,60.35,55.25,49.3,53.55,48.449999999999996,42.5,"bov"]
[null,1,2,"bov",1,{"$f":"I$8","v":48.449999999999996},null,null,{"$f":"(I11*0.85)","v":48.449999999999996},45.05,40.799999999999997,44.199999999999996,40.799999999999997,36.549999999999997,39.1,35.699999999999996,32.299999999999997,"o"]
[null,1,1,"bov",1,{"$f":"I$9","v":29.75},null,null,29.75,28.05,24.65,28.05,26.349999999999998,23.8,24.65,23.8,21.25,"v"]
[null,1,3,"sui",1,{"$f":"I$10","v":79},null,null,79,73,67,71,65,58,63,57,50,"sui"]
[null,1,2,"sui",1,{"$f":"I$11","v":57},null,null,57,53,48,52,48,43,46,42,38,"u"]
[null,1,1,"sui",1,{"$f":"I$12","v":35},null,null,35,33,29,33,31,28,29,28,25,"i"]
[null,1,3,"dig_tq",1,{"$f":"I$13","v":67.149999999999991},null,null,67.149999999999991,62.05,56.949999999999996,60.35,55.25,49.3,53.55,48.449999999999996,42.5,"dig_tq"]
[null,1,2,"dig_tq",1,{"$f":"I$14","v":48.449999999999996},null,null,48.449999999999996,45.05,40.799999999999997,44.199999999999996,40.799999999999997,36.549999999999997,39.1,35.699999999999996,32.299999999999997,"i"]
[null,1,1,"dig_tq",1,{"$f":"I$15","v":29.75},null,null,29.75,28.05,24.65,28.05,26.349999999999998,23.8,24.65,23.8,21.25,"g"]
[null,1,3,"dig_sui",1,{"$f":"I$16","v":79},null,null,79,73,67,71,65,58,63,57,50,"dig_sui"]
[null,1,2,"dig_sui",1,{"$f":"I$17","v":57},null,null,57,53,48,52,48,43,46,42,38,"u"]
[null,1,1,"dig_sui",1,{"$f":"I$18","v":35},null,null,35,33,29,33,31,28,29,28,25,"i"]
[null,1,3,"dig_avi",1,{"$f":"I$19","v":90.85},null,null,90.85,83.949999999999989,77.05,81.649999999999991,74.75,66.699999999999989,72.449999999999989,65.55,57.499999999999993,"dig_avi"]
[null,1,2,"dig_avi",1,{"$f":"I$20","v":65.55},null,null,65.55,60.949999999999996,55.199999999999996,59.8,55.199999999999996,49.449999999999996,52.9,48.3,43.699999999999996,"i"]
[null,1,1,"dig_avi",1,{"$f":"I$21","v":40.25},null,null,40.25,37.949999999999996,33.349999999999994,37.949999999999996,35.65,32.199999999999996,33.349999999999994,32.199999999999996,28.749999999999996,"g"]
[null,1,3,"dig_chi",1,{"$f":"I$22","v":90.85},null,null,90.85,83.949999999999989,77.05,81.649999999999991,74.75,66.699999999999989,72.449999999999989,65.55,57.499999999999993,"dig_chi"]
[null,1,2,"dig_chi",1,{"$f":"I$23","v":65.55},null,null,65.55,60.949999999999996,55.199999999999996,59.8,55.199999999999996,49.449999999999996,52.9,48.3,43.699999999999996,"i"]
[null,1,1,"dig_chi",1,{"$f":"I$24","v":40.25},null,null,40.25,37.949999999999996,33.349999999999994,37.949999999999996,35.65,32.199999999999996,33.349999999999994,32.199999999999996,28.749999999999996,"g"]
[null,1,3,"fanghi",1,{"$f":"I$25","v":67.149999999999991},null,null,67.149999999999991,62.05,56.949999999999996,60.35,55.25,49.3,53.55,48.449999999999996,42.5,"fanghi"]
[null,1,2,"fanghi",1,{"$f":"I$26","v":48.449999999999996},null,null,48.449999999999996,45.05,40.799999999999997,44.199999999999996,40.799999999999997,36.549999999999997,39.1,35.699999999999996,32.299999999999997,"i"]
[null,1,1,"fanghi",1,{"$f":"I$27","v":29.75},null,null,29.75,28.05,24.65,28.05,26.349999999999998,23.8,24.65,23.8,21.25,"g"]
[null,1,3,"avi",2,{"$f":"J$4","v":83.949999999999989}]
[null,1,2,"avi",2,{"$f":"J$5","v":60.949999999999996}]
[null,1,1,"avi",2,{"$f":"J$6","v":37.949999999999996}]
[null,1,3,"bov",2,{"$f":"J$7","v":62.05}]
[null,1,2,"bov",2,{"$f":"J$8","v":45.05}]
[null,1,1,"bov",2,{"$f":"J$9","v":28.05}]
[null,1,3,"sui",2,{"$f":"J$10","v":73}]
[null,1,2,"sui",2,{"$f":"J$11","v":53}]
[null,1,1,"sui",2,{"$f":"J$12","v":33}]
[null,1,3,"dig_tq",2,{"$f":"J$13","v":62.05}]
[null,1,2,"dig_tq",2,{"$f":"J$14","v":45.05}]
[null,1,1,"dig_tq",2,{"$f":"J$15","v":28.05}]
[null,1,3,"dig_sui",2,{"$f":"J$16","v":73}]
[null,1,2,"dig_sui",2,{"$f":"J$17","v":53}]
[null,1,1,"dig_sui",2,{"$f":"J$18","v":33}]
[null,1,3,"dig_avi",2,{"$f":"J$19","v":83.949999999999989}]
[null,1,2,"dig_avi",2,{"$f":"J$20","v":60.949999999999996}]
[null,1,1,"dig_avi",2,{"$f":"J$21","v":37.949999999999996}]
[null,1,3,"dig_chi",2,{"$f":"J$22","v":83.949999999999989}]
[null,1,2,"dig_chi",2,{"$f":"J$23","v":60.949999999999996}]
[null,1,1,"dig_chi",2,{"$f":"J$24","v":37.949999999999996}]
[null,1,3,"fanghi",2,{"$f":"J$25","v":62.05}]
[null,1,2,"fanghi",2,{"$f":"J$26","v":45.05}]
[null,1,1,"fanghi",2,{"$f":"J$27","v":28.05}]
[null,1,3,"avi",3,{"$f":"K$4","v":77.05}]
[null,1,2,"avi",3,{"$f":"K$5","v":55.199999999999996}]
[null,1,1,"avi",3,{"$f":"K$6","v":33.349999999999994}]
[null,1,3,"bov",3,{"$f":"K$7","v":56.949999999999996}]
[null,1,2,"bov",3,{"$f":"K$8","v":40.799999999999997}]
[null,1,1,"bov",3,{"$f":"K$9","v":24.65}]
[null,1,3,"sui",3,{"$f":"K$10","v":67}]
[null,1,2,"sui",3,{"$f":"K$11","v":48}]
[null,1,1,"sui",3,{"$f":"K$12","v":29}]
[null,1,3,"dig_tq",3,{"$f":"K$13","v":56.949999999999996}]
[null,1,2,"dig_tq",3,{"$f":"K$14","v":40.799999999999997}]
[null,1,1,"dig_tq",3,{"$f":"K$15","v":24.65}]
[null,1,3,"dig_sui",3,{"$f":"K$16","v":67}]
[null,1,2,"dig_sui",3,{"$f":"K$17","v":48}]
[null,1,1,"dig_sui",3,{"$f":"K$18","v":29}]
[null,1,3,"dig_avi",3,{"$f":"K$19","v":77.05}]
[null,1,2,"dig_avi",3,{"$f":"K$20","v":55.199999999999996}]
[null,1,1,"dig_avi",3,{"$f":"K$21","v":33.349999999999994}]
[null,1,3,"dig_chi",3,{"$f":"K$22","v":77.05}]
[null,1,2,"dig_chi",3,{"$f":"K$23","v":55.199999999999996}]
[null,1,1,"dig_chi",3,{"$f":"K$24","v":33.349999999999994}]
[null,1,3,"fanghi",3,{"$f":"K$25","v":56.949999999999996}]
[null,1,2,"fanghi",3,{"$f":"K$26","v":40.799999999999997}]
[null,1,1,"fanghi",3,{"$f":"K$27","v":24.65}]
[null,2,3,"avi",1,{"$f":"L4","v":81.649999999999991}]
[null,2,2,"avi",1,59.8]
[null,2,1,"avi",1,37.949999999999996]
[null,2,3,"bov",1,60.35]
[null,2,2,"bov",1,44.199999999999996]
[null,2,1,"bov",1,28.05]
[null,2,3,"sui",1,71]
[null,2,2,"sui",1,52]
[null,2,1,"sui",1,33]
[null,2,3,"dig_tq",1,60.35]
[null,2,2,"dig_tq",1,44.199999999999996]
[null,2,1,"dig_tq",1,28.05]
[null,2,3,"dig_sui",1,{"$f":"L$16","v":71}]
[null,2,2,"dig_sui",1,{"$f":"L$17","v":52}]
[null,2,1,"dig_sui",1,{"$f":"L$18","v":33}]
[null,2,3,"dig_avi",1,{"$f":"L$19","v":81.649999999999991}]
[null,2,2,"dig_avi",1,{"$f":"L$20","v":59.8}]
[null,2,1,"dig_avi",1,{"$f":"L$21","v":37.949999999999996}]
[null,2,3,"dig_chi",1,{"$f":"L22","v":81.649999999999991}]
[null,2,2,"dig_chi",1,59.8]
[null,2,1,"dig_chi",1,37.949999999999996]
[null,2,3,"fanghi",1,60.35]
[null,2,2,"fanghi",1,44.199999999999996]
[null,2,1,"fanghi",1,28.05]
[null,2,3,"avi",2,{"$f":"M4","v":74.75}]
[null,2,2,"avi",2,55.199999999999996]
[null,2,1,"avi",2,35.65]
[null,2,3,"bov",2,55.25]
[null,2,2,"bov",2,40.799999999999997]
[null,2,1,"bov",2,26.349999999999998]
[null,2,3,"sui",2,65]
[null,2,2,"sui",2,48]
[null,2,1,"sui",2,31]
[null,2,3,"dig_tq",2,55.25]
[null,2,2,"dig_tq",2,40.799999999999997]
[null,2,1,"dig_tq",2,26.349999999999998]
[null,2,3,"dig_sui",2,{"$f":"M$16","v":65}]
[null,2,2,"dig_sui",2,{"$f":"M$17","v":48}]
[null,2,1,"dig_sui",2,{"$f":"M$18","v":31}]
[null,2,3,"dig_avi",2,{"$f":"M$19","v":74.75}]
[null,2,2,"dig_avi",2,{"$f":"M$20","v":55.199999999999996}]
[null,2,1,"dig_avi",2,{"$f":"M$21","v":35.65}]
[null,2,3,"dig_chi",2,{"$f":"M22","v":74.75}]
[null,2,2,"dig_chi",2,55.199999999999996]
[null,2,1,"dig_chi",2,35.65]
[null,2,3,"fanghi",2,55.25]
[null,2,2,"fanghi",2,40.799999999999997]
[null,2,1,"fanghi",2,26.349999999999998]
[null,2,3,"avi",3,{"$f":"N4","v":66.699999999999989}]
[null,2,2,"avi",3,49.449999999999996]
[null,2,1,"avi",3,32.199999999999996]
[null,2,3,"bov",3,49.3]
[null,2,2,"bov",3,36.549999999999997]
[null,2,1,"bov",3,23.8]
[null,2,3,"sui",3,58]
[null,2,2,"sui",3,43]
[null,2,1,"sui",3,28]
[null,2,3,"dig_tq",3,49.3]
[null,2,2,"dig_tq",3,36.549999999999997]
[null,2,1,"dig_tq",3,23.8]
[null,2,3,"dig_sui",3,{"$f":"N$16","v":58}]
[null,2,2,"dig_sui",3,{"$f":"N$17","v":43}]
[null,2,1,"dig_sui",3,{"$f":"N$18","v":28}]
[null,2,3,"dig_avi",3,{"$f":"N$19","v":66.699999999999989}]
[null,2,2,"dig_avi",3,{"$f":"N$20","v":49.449999999999996}]
[null,2,1,"dig_avi",3,{"$f":"N$21","v":32.199999999999996}]
[null,2,3,"dig_chi",3,{"$f":"N22","v":66.699999999999989}]
[null,2,2,"dig_chi",3,49.449999999999996]
[null,2,1,"dig_chi",3,32.199999999999996]
[null,2,3,"fanghi",3,49.3]
[null,2,2,"fanghi",3,36.549999999999997]
[null,2,1,"fanghi",3,23.8]
[null,3,3,"avi",1,{"$f":"O4","v":72.449999999999989}]
[null,3,2,"avi",1,52.9]
[null,3,1,"avi",1,33.349999999999994]
[null,3,3,"bov",1,53.55]
[null,3,2,"bov",1,39.1]
[null,3,1,"bov",1,24.65]
[null,3,3,"sui",1,63]
[null,3,2,"sui",1,46]
[null,3,1,"sui",1,29]
[null,3,3,"dig_tq",1,53.55]
[null,3,2,"dig_tq",1,39.1]
[null,3,1,"dig_tq",1,24.65]
[null,3,3,"dig_sui",1,{"$f":"O$16","v":63}]
[null,3,2,"dig_sui",1,{"$f":"O$17","v":46}]
[null,3,1,"dig_sui",1,{"$f":"O$18","v":29}]
[null,3,3,"dig_avi",1,{"$f":"O$19","v":72.449999999999989}]
[null,3,2,"dig_avi",1,{"$f":"O$20","v":52.9}]
[null,3,1,"dig_avi",1,{"$f":"O$21","v":33.349999999999994}]
[null,3,3,"dig_chi",1,{"$f":"O22","v":72.449999999999989}]
[null,3,2,"dig_chi",1,52.9]
[null,3,1,"dig_chi",1,33.349999999999994]
[null,3,3,"fanghi",1,53.55]
[null,3,2,"fanghi",1,39.1]
[null,3,1,"fanghi",1,24.65]
[null,3,3,"avi",2,{"$f":"P4","v":65.55}]
[null,3,2,"avi",2,48.3]
[null,3,1,"avi",2,32.199999999999996]
[null,3,3,"bov",2,48.449999999999996]
[null,3,2,"bov",2,35.699999999999996]
[null,3,1,"bov",2,23.8]
[null,3,3,"sui",2,57]
[null,3,2,"sui",2,42]
[null,3,1,"sui",2,28]
[null,3,3,"dig_tq",2,48.449999999999996]
[null,3,2,"dig_tq",2,35.699999999999996]
[null,3,1,"dig_tq",2,23.8]
[null,3,3,"dig_sui",2,{"$f":"P$16","v":57}]
[null,3,2,"dig_sui",2,{"$f":"P$17","v":42}]
[null,3,1,"dig_sui",2,{"$f":"P$18","v":28}]
[null,3,3,"dig_avi",2,{"$f":"P$19","v":65.55}]
[null,3,2,"dig_avi",2,{"$f":"P$20","v":48.3}]
[null,3,1,"dig_avi",2,{"$f":"P$21","v":32.199999999999996}]
[null,3,3,"dig_chi",2,{"$f":"P22","v":65.55}]
[null,3,2,"dig_chi",2,48.3]
[null,3,1,"dig_chi",2,32.199999999999996]
[null,3,3,"fanghi",2,48.449999999999996]
[null,3,2,"fanghi",2,35.699999999999996]
[null,3,1,"fanghi",2,23.8]
[null,3,3,"avi",3,{"$f":"Q4","v":57.499999999999993}]
[null,3,2,"avi",3,43.699999999999996]
[null,3,1,"avi",3,28.749999999999996]
[null,3,3,"bov",3,42.5]
[null,3,2,"bov",3,32.299999999999997]
[null,3,1,"bov",3,21.25]
[null,3,3,"sui",3,50]
[null,3,2,"sui",3,38]
[null,3,1,"sui",3,25]
[null,3,3,"dig_tq",3,42.5]
[null,3,2,"dig_tq",3,32.299999999999997]
[null,3,1,"dig_tq",3,21.25]
[null,3,3,"dig_sui",3,{"$f":"Q$16","v":50}]
[null,3,2,"dig_sui",3,{"$f":"Q$17","v":38}]
[null,3,1,"dig_sui",3,{"$f":"Q$18","v":25}]
[null,3,3,"dig_avi",3,{"$f":"Q$19","v":57.499999999999993}]
[null,3,2,"dig_avi",3,{"$f":"Q$20","v":43.699999999999996}]
[null,3,1,"dig_avi",3,{"$f":"Q$21","v":28.749999999999996}]
[null,3,3,"dig_chi",3,{"$f":"Q22","v":57.499999999999993}]
[null,3,2,"dig_chi",3,43.699999999999996]
[null,3,1,"dig_chi",3,28.749999999999996]
[null,3,3,"fanghi",3,42.5]
[null,3,2,"fanghi",3,32.299999999999997]
[null,3,1,"fanghi",3,21.25]
[null,1,2,3,4,5]
[null,"criteri"]
[null,"ID_Rag","ID_Liv","ID_Sett","ID_N_org"]
["Fert. 1",{"$f":"Suolo!E19","v":3},{"$f":"Ciclo_Modalità!G44","v":3},{"$f":"Fert_org!D27","v":"bov"},{"$f":"Mod_distribuz!K7","v":1},{"$f":"DGET($B$3:$F$219,F$220,B222:E223)","v":53.55}]
[null,"ID_Rag","ID_Liv","ID_Sett","ID_N_org"]
["Fert. 2",{"$f":"Suolo!E19","v":3},{"$f":"Ciclo_Modalità!G46","v":2},{"$f":"Fert_org!D29","v":"bov"},{"$f":"Mod_distribuz!K9","v":1},{"$f":"DGET($B$3:$F$219,F$220,B224:E225)","v":39.1}]
[null,"ID_Rag","ID_Liv","ID_Sett","ID_N_org"]
["Fert. 3",{"$f":"Suolo!E19","v":3},{"$f":"Ciclo_Modalità!G48","v":3},{"$f":"Fert_org!D31","v":"nn"},{"$f":"Mod_distribuz!K11","v":1},{"$f":"DGET($B$3:$F$219,F$220,B226:E227)","v":{"$error":"#VALUE!"}}]

{"sheet":"Tipo_Fert","index":31,"n_rows":14,"n_cols":8,"rows_kept":14,"cut":false,"hidden":true,"merged":[]}
["Classificazione tipologia dei fertilizzanti"]
[]
[null,"ID_Tip_fer","Tipo","Consistenza","Funzione prevalente","Caratteristica","Efficienza","note"]
[null,1,"nessuno","nessuna","nessuna","nessuna","nessuna"]
[null,2,"Letame e assimilati","palabile","ammendante","a lenta degradabilità","bassa","sono assimilati: frazione palabile digestato, correttivi e altre sostanze vegetali"]
[null,3,"Compost","palabile","ammendante","a lenta degradabilità","bassa"]
[null,4,"Lettiera esausta polli da carne","palabile","concimante","a rapida mineralizzazione","media"]
[null,5,"Fanghi ","palabile","concimante","a rapida mineralizzazione","media","è equiparato come funzione concimante agli effluenti bovini"]
[null,6,"Liquami e frazioni palabili zootecniche","liquida","concimante","a rapida mineralizzazione","media"]
[null,7,"Digestato_biogas tal quale","liquida","concimante","a rapida mineralizzazione","media"]
[null,8,"Pollina preessicata","palabile","concimante","a rapida mineralizzazione","medio alta"]
[null,9,"Organico","liquida/palabile","concimante","a rapida mineralizzazione","alta"]
[null,10,"Organo Minerale","palabile","concimante","a rapida mineralizzazione","alta"]
[null,11,"Concime min.e/o di sintesi","liquida/palabile","concimante","pronta disponibilità","alta"]

{"sheet":"Gri_P","index":32,"n_rows":28,"n_cols":13,"rows_kept":28,"cut":false,"hidden":true,"merged":[[18,1,18,6]]}
["Dotazioni di fosforo assimilabile (ppm) metodo Olsen",null,null,null,null,null,null,null,null,null,"ID_F_P","forma","convers."]
["ID_Gri_P","min P","max P","min P2O5","max P2O5","Giudizio","Classe dotaz.","proposte dal SILPA",null,null,1,"P2O5",0.43668099999999999]
[1,0,5,0,{"$f":"(C3*2.29)","v":11.45},"molto bassa","molto scarso",null,"< 5",null,2,"P",1]
[2,5,10,{"$f":"(B4*2.29)","v":11.45},{"$f":"(C4*2.29)","v":22.9},"bassa","scarso","=> 5","< 10",null,{"$f":"Codici!AD2","v":2},{"$f":"VLOOKUP($K4,$K$2:$M$3,2)","v":"P"},{"$f":"VLOOKUP($K4,$K$2:$M$3,3)","v":1}]
[3,10,15,{"$f":"(B5*2.29)","v":22.9},{"$f":"(C5*2.29)","v":34.35},"media","normale","=> 10","< 15"]
[4,15,30,{"$f":"(B6*2.29)","v":34.35},{"$f":"(C6*2.29)","v":68.7},"elevata","normale","=> 15","< 30",null,null,"tenore","iniziale"]
[5,30,999,{"$f":"(B7*2.29)","v":68.7},{"$f":"(C7*2.29)","v":2287.71}," molto elevata","molto alto","=> 30",null,null,"digitato","P","P2O5"]
[null,"Cercati in vert. Con tenore iniziale  P",null,null,null,null,null,null,null,null,{"$f":"Codici!AE2","v":41},{"$f":"Codici!AE2*M4","v":41},{"$f":"(L8*2.29)","v":93.89}]
[null,null,null,null,null,"Giudizio","Classe dotaz. (*)","*) usata nelle schede",null,null,"Fattore immobilizzazione \"C\""]
[{"$f":"DGET($A$2:$F$7,1,$F$9:$F$10)","v":5},{"$f":"VLOOKUP($L$8,$B$3:$F$7,1)","v":30},{"$f":"VLOOKUP($L$8,$B$3:$F$7,2)","v":999},{"$f":"VLOOKUP($L$8,$B$3:$F$7,3)","v":68.7},{"$f":"VLOOKUP($L$8,$B$3:$F$7,4)","v":2287.71},{"$f":"VLOOKUP($L$8,$B$3:$F$7,5)","v":" molto elevata"},{"$f":"VLOOKUP($L$8,$B$3:$G$7,6)","v":"molto alto"},null,null,null,null,{"$f":"(Ragg_Tes!D9+(0.02*Codici!U2))","v":1.72}]
[]
["La dotazione scarsa contiene i giudizi molto bassa e bassa, quello normale comprende i giudizi media ed elevata:"]
[null,null,null,"min P2O5","max P2O5","Dotazione"]
[null,"Criterio",null,0,{"$f":"E4","v":22.9},"scarsa","Arricchimento","B1",{"$f":"IF(OR(G10=\"scarso\",G10=\"molto scarso\"),-G22*L10,0)","v":0}]
[null,"Dotazione",null,{"$f":"D5","v":22.9},{"$f":"E6","v":68.7},"normale","Mantenimento","A",{"$f":"A!E231","v":28}]
[null,"normale",null,{"$f":"D7","v":68.7},{"$f":"E7","v":2287.71},"molto alta","Riduzione","B2",{"$f":"IF(OR(G10=\"normale\",G10=\"scarso\",G10=\"molto scarso\"),0,G23)","v":90.683999999999983}]
[null,null,null,{"$f":"DGET($D$13:$F$16,1,$B$15:$B$16)","v":22.9},{"$f":"DGET($D$13:$F$16,2,$B$15:$B$16)","v":68.7}]
[null,null,null,null,null,null,null,"Asportaz.","Anticipaz."]
[null,"Differenza  tra il valore delle analisi ed i limiti di normalità",null,null,null,null,null,"future","ammiss."]
[null,null,null,"P2O5",null,null,"x 30 cm"]
[null,null,"limite","ppm",null,null,"kg/ha"]
[null,null,"inferiore",{"$f":"(M8-D17)","v":70.990000000000009},{"$f":"IF(D22>0,\"esiste una riserva di\",\"esiste un deficit di\")","v":"esiste una riserva di"},null,{"$f":"(D22*Ragg_Tes!F9)/1000","v":255.56400000000002},{"$f":"(A!E234)*Codici!$AV$2","v":4900}]
[null,null,"superiore",{"$f":"(M8-E17)","v":25.189999999999998},{"$f":"IF(D23>0,\"esiste un esubero di\",\" \")","v":"esiste un esubero di"},null,{"$f":"(D23*Ragg_Tes!F9)/1000","v":90.683999999999983},null,{"$f":"IF(G23>0,H22-G23,H22)","v":4809.3159999999998}]
[]
[]
[null,"Dotazione finale se si apportano le quantità indicate nel piano di distribuzione"]
[null,"in ","P2O5",{"$f":"(M8+('Apporti al terreno'!P25*1000/Ragg_Tes!F9)/Gri_P!L10)","v":89.3680361757106}]
[null,"in ","P",{"$f":"(D27*M2)","v":39.02532340524548}]

{"sheet":"Gri_K","index":33,"n_rows":39,"n_cols":25,"rows_kept":39,"cut":false,"hidden":true,"merged":[[22,0,22,5],[13,12,13,14],[8,16,8,18],[15,16,15,19],[31,12,31,14],[21,9,21,10]]}
["Dotazione di K scambiabile (ppm)",null,null,null,null,null,null,null,null,null,null,null,"Tenore di Potassio",null,null,null,"Contenuto di Magnesio",null,null,null,"Capacità di scambio cationica (meq/100 g)"]
["ID_Gri_K","Raggruppamento","min K","max K","min K2O","max K2O","Dotazione","ID_Dot_K",null,"Raggruppamento","Dbase",null,"digitato",{"$f":"N12","v":"ppm"},{"$f":"Codici!AI2","v":385},null,"digitato",{"$f":"R7","v":"meq/"},{"$f":"Inserimento!R23","v":0},null,"CSC","valutazione","ID_CSC","CSC","valutazione"]
[1,"Sabbiosi",0,40,{"$f":"(C3*1.2)","v":0},{"$f":"(D3*1.2)","v":48},"molto bassa",1,null,"Sabbiosi","C3:H6",null,null,null,null,null,null,null,null,null,"< 10 ","bassa",0,0,"non valorizzato"]
[2,"Sabbiosi",40,80,48,96,"bassa",2,null,"Medio impasto","C7:H10",null,"ID_F_K","Forma","convers.",null,"ID_M_Mg","Misura","convers.",null,"10 - 20","media",1,1,"bassa"]
[3,"Sabbiosi",80,120,96,144,"media",3,null,"Argillosi e limosi","C11:H14",null,1,"K2O",0.83333000000000002,null,1,"ppm",1,null,"> 20","alta",2,10,"media"]
[4,"Sabbiosi",120,999,144,1198.8,"elevata",4,null,"Criterio",null,null,2,"K",1,null,2,"meq/",121.5,null,null,null,3,20,"alta"]
[5,"Medio impasto",0,60,0,72,"molto bassa",1,null,"Raggruppamento","Dbase",null,{"$f":"Codici!AH2","v":1},{"$f":"VLOOKUP($M$7,$M$5:$O$6,2)","v":"K2O"},{"$f":"VLOOKUP($M$7,$M$5:$O$6,3)","v":0.83333000000000002},null,{"$f":"Codici!AK2","v":2},{"$f":"VLOOKUP($Q$7,$Q$5:$S$6,2)","v":"meq/"},{"$f":"VLOOKUP($Q$7,$Q$5:$S$6,3)","v":121.5},null,null,null,4,30,"molto alta"]
[6,"Medio impasto",60,100,72,120,"bassa",2,null,{"$f":"Suolo!F19","v":"Argillosi e limosi"},{"$f":"DGET(J2:K5,K2,J7:J8)","v":"C11:H14"},null,null,null,null,null,null,null,null,null,null,null,5,50,"errore"]
[7,"Medio impasto",100,150,120,180,"media",3,null,null,null,null,"ID_M_K","Misura","convers.",null,"Tenore iniziale Magnesio",null,null,null,null,null,null,"CSC","valutazione"]
[8,"Medio impasto",150,999,180,1198.8,"elevata",4,null,"Intervallo normalità",null,null,1,"ppm",1,null,null,"Mg",null,null,null,null,{"$f":"DGET(W2:Y8,W2,Y9:Y10)","v":0},{"$f":"IF(Inserimento!R26<1,0,Inserimento!R26)","v":0},{"$f":"VLOOKUP(X10,X3:Y8,2)","v":"non valorizzato"}]
[9,"Argillosi e limosi",0,80,0,96,"molto bassa",1,null,"minimo","massimo",null,2,"meq/",{"$f":"J31","v":391},null,"in ppm",{"$f":"IF(S2<1,0,(S2*S7))","v":0}]
[10,"Argillosi e limosi",80,120,96,144,"bassa",2,"K",{"$f":"DGET($A$2:$G$14,C$2,$J$15:$K$16)","v":120},{"$f":"DGET($A$2:$G$14,D$2,$J$15:$K$16)","v":180},null,{"$f":"Codici!AG2","v":1},{"$f":"VLOOKUP($M$12,$M$10:$O$11,2)","v":"ppm"},{"$f":"VLOOKUP($M$12,$M$10:$O$11,3)","v":1},null,"in meq",{"$f":"IF(S2<1,0,(R11*K32))","v":0},null,null,"Contenuto di Magnesio (ppm)"]
[11,"Argillosi e limosi",120,180,144,216,"media",3,"K2O",{"$f":"DGET($A$2:$G$14,E$2,$J$15:$K$16)","v":144},{"$f":"DGET($A$2:$G$14,F$2,$J$15:$K$16)","v":216},null,null,null,null,null,null,null,null,null,"Mg","valutazione","ID_Mg","Mg","valutazione"]
[12,"Argillosi e limosi",180,999,216,1198.8,"elevata",4,null,"Criteri",null,null,"tenore iniziale  Potassio",null,null,null,"Rapporto Mg/K",null,{"$f":"IF(S2<1,0,R12/N17)","v":0},null,"<50","molto scarso",0,0,"non valorizzato"]
[null,"criteri x ricerca ID_Gri_K2O",null,null,null,null,null,null,null,"Raggruppamento","Dotazione",null,null,"K","K2O",null,null,null,null,null,"=> 50  < 100","scarso",1,1,"molto scarso"]
[null,null,"Cercati in vert. Con tenore iniziale  K",null,null,null,null,null,null,{"$f":"Suolo!F19","v":"Argillosi e limosi"},"media",null,"in ppm",{"$f":"IF(M12=1,(O2*O7),O2*J31)","v":320.83204999999998},{"$f":"(N16*1.2)","v":384.99845999999997},null,"Valutazione Rapporto Mg/K",null,null,null,"=> 100  < 150","medio",2,50,"scarso"]
["ID_Gri_K","Raggruppamento","min K","max K","min K2O","max K2O","Dotazione","ID_Dot_K",null,"Raggruppamento","Dotazione",null,"in meq",{"$f":"(N16*K31)","v":0.82054232736572896},null,null,"ID_Mg/K","in meq","in ppm","valutazione","=> 150  < 200","buono",3,100,"medio"]
[{"$f":"DGET(A2:G14,1,B17:G18)","v":12},{"$f":"Suolo!F19","v":"Argillosi e limosi"},{"$f":"VLOOKUP($N$16,INDIRECT($K$8),1)","v":180},{"$f":"VLOOKUP($N$16,INDIRECT($K$8),2)","v":999},{"$f":"VLOOKUP($N$16,INDIRECT($K$8),3)","v":216},{"$f":"VLOOKUP($N$16,INDIRECT($K$8),4)","v":1198.8},{"$f":"VLOOKUP($N$16,INDIRECT(K8),5)","v":"elevata"},{"$f":"VLOOKUP($N$16,INDIRECT(K8),6)","v":4},null,{"$f":"Suolo!F19","v":"Argillosi e limosi"},"media",null,null,null,null,null,0,0,{"$f":"(J$32/J$31)*R18","v":0},"non calcolato","=> 200  < 250","ricco",4,150,"buono"]
[null,null,"Cercati in vert. Con dotazione bassa",null,null,null,null,null,null,"Fattore di immobilizzazione \"G\"",null,null,"Perdite",null,null,null,1,0.1,3.1074168797953966E-2,"basso","= >250","molto ricco",5,200,"ricco"]
["ID_Gri_K","Raggruppamento","min K","max K","min K2O","max K2O","Dotazione","ID_Dot_K",null,null,{"$f":"(1+(0.018*Codici!Q2))","v":1.63},null,"Argilla %:",{"$f":"Codici!Q2","v":35},"H",null,2,2.1,0.65255754475703331,"equilibrato",null,null,6,250,"molto ricco"]
[{"$f":"DGET(A2:H14,1,J17:K18)","v":11},{"$f":"Suolo!F19","v":"Argillosi e limosi"},{"$f":"VLOOKUP($A$21,$A$3:$H$14,3)","v":120},{"$f":"VLOOKUP($A$21,$A$3:$H$14,4)","v":180},{"$f":"VLOOKUP($A$21,$A$3:$H$14,5)","v":144},{"$f":"VLOOKUP($A$21,$A$3:$H$14,6)","v":216},{"$f":"K18","v":"media"},{"$f":"VLOOKUP($A$21,$A$3:$H$14,8)","v":3},null,null,null,null,"Lisciviazione",null,{"$f":"VLOOKUP(N20,M23:N28,2)","v":10},null,3,5.0999999999999996,1.5847826086956522,"alto",null,null,null,"Mg","valutazione"]
[null,null,null,null,null,null,"Asportaz.",null,null,"valore minimo critico",null,null,"argilla","perdita",null,null,4,6.01,1.8675575447570334,"molto alto",null,null,{"$f":"DGET(W13:Y20,W13,Y21:Y22)","v":0},{"$f":"R11","v":0},{"$f":"VLOOKUP(X22,X14:Y20,2)","v":"non valorizzato"}]
["Differenze  tra il valore delle analisi ed i limiti di normalità",null,null,null,null,null,"future",null,null,"catione","% su CSC",null,"%","kg/ha",null,null,5,100,31.074168797953966,"errato"]
[null,null,"K2O",null,null,"x 30 cm",null,null,null,"K",2.5,null,0,60,null,null,null,null,null,"valutazione"]
[null,"limite","ppm",null,null,"kg/ha",null,"Anticipaz.",null,"Mg",7,null,5.0999999999999996,30,null,null,{"$f":"DGET(Q17:T23,Q17,T24:T25)","v":0},{"$f":"S14","v":0},{"$f":"VLOOKUP($R$25,$R$18:$T$22,2)","v":0},{"$f":"VLOOKUP($R$25,$R$18:$T$23,3)","v":"non calcolato"}]
[null,"inferiore",{"$f":"(O16-J13)","v":240.99845999999997},{"$f":"IF(C26>0,\"esiste una riserva di\",\"esiste un deficit di\")","v":"esiste una riserva di"},null,{"$f":"(C26*Ragg_Tes!F9)/1000","v":867.59445599999992},{"$f":"(A!F234)*Codici!$AV$2","v":3500},"ammiss.",null,"Ca",70,null,15.1,20]
[null,"superiore",{"$f":"(O16-K13)","v":168.99845999999997},{"$f":"IF(C27>0,\"esiste un esubero di\",\" \")","v":"esiste un esubero di"},null,{"$f":"(C27*Ragg_Tes!F9)/1000","v":608.39445599999988},null,{"$f":"IF(F27>0,G26-F27,G26)","v":2891.605544},null,null,null,null,25.1,10]
[null,null,null,null,null,null,null,null,null,null,null,null,100,10]
[null,"Arricchimento",null,null,"F1",{"$f":"IF(OR(G18=\"bassa\",G18=\"molto bassa\"),-F26*K20,0)","v":0}]
[null,"Mantenimento",null,null,"A+H",{"$f":"(A!F231+Gri_K!O21)","v":30},null,null,"Passaggio da me/100g a ppm e viceversa",null,null,null,"Rapporto K/CSC",null,{"$f":"IF(X10=0,100,(N17/X10)*100)","v":100}]
[null,"Riduzione",null,null,"F2",{"$f":"IF(G18=\"elevata\",F27,0)","v":608.39445599999988},null,null,"K",391,{"$f":"(1/J31)","v":2.5575447570332483E-3}]
[null,null,null,null,null,null,null,null,"Mg",121.5,{"$f":"(1/J32)","v":8.23045267489712E-3},null,"Valutazione Rapporto K/C.S.C."]
["Dotazione di K2O presa a riferimento per il calcolo dei fabbisogni colturali",null,null,null,null,null,{"$f":"IF(K36=\"NO\",O16,K37)","v":384.99845999999997},null,"Ca",200.4,4.9900199600798403E-3,null,"ID_K/CSC","%","valutazione"]
[null,null,null,null,null,null,null,null,"Na",230,4.3478260869565218E-3,null,1,0.1,"basso"]
["Dotazione finale se si apportano le quantità indicate nel piano di distribuzione",null,null,null,null,null,null,null,null,null,null,null,2,2.1,"ottimale"]
["in ","K2O",{"$f":"(O16+('Apporti al terreno'!S25*1000/Ragg_Tes!F9)/Gri_K!K20)","v":379.88598556237213},null,null,null,null,"Correzione dotazione di potassio",null,null,{"$f":"IF(AND(Q25<=3,M39>=2),\"NO\",\"Sì\")","v":"NO"},null,3,5.0999999999999996,"alto"]
["in ","K",{"$f":"(C36*O5)","v":316.57038834869155},null,null,null,null,"Valore appropriato se opera la correzione",null,null,{"$f":"MINA(O16,E21)","v":144},null,4,100,"non calcolato"]
[null,null,null,null,null,null,null,"Classe di dotazione presa a riferimento",null,null,{"$f":"IF(K36=\"Sì\",K18,G18)","v":"elevata"},null,null,null,"valutazione"]
[null,null,null,null,null,null,null,null,null,null,null,null,{"$f":"DGET(M33:O37,M33,O38:O39)","v":4},{"$f":"O30","v":100},{"$f":"VLOOKUP($N$39,$N$34:$O$37,2)","v":"non calcolato"}]

{"sheet":"Calcare","index":34,"n_rows":26,"n_cols":6,"rows_kept":26,"cut":false,"hidden":true,"merged":[]}
["Contenuto in calcare totale (%)",null,null,"digitato"]
[null,null,null,{"$f":"Codici!U2","v":16},"proposte dal SILPA"]
["ID-Cal_tot","min_CaCO3","max_CaCO3","giudizio","min","max"]
[1,0,1,"Non calcareo",null,"< 1"]
[2,1,10,"Poco calcareo","=> 1","< 10"]
[3,10,25,"Mediamente calcareo","=> 10","< 25"]
[4,25,50,"Calcareo","=> 25","< 50"]
[5,50,100,"Molto calcareo","=> 50"]
[null,"Criterio x ricerca ID_Cal_tot e SILPA"]
[null,"cerca vert. Digitato"]
[null,"min_CaCO3","max_CaCO3","giudizio"]
[{"$f":"DGET($A$3:$F$8,1,$B$11:$D$12)","v":3},{"$f":"VLOOKUP(Codici!$U$2,$B$4:$D$8,1)","v":10},{"$f":"VLOOKUP(Codici!$U$2,$B$4:$D$8,2)","v":25},{"$f":"VLOOKUP(Codici!$U$2,$B$4:$D$8,3)","v":"Mediamente calcareo"},{"$f":"DGET($A$3:$F$8,5,$B$11:$D$12)","v":"=> 10"},{"$f":"DGET($A$3:$F$8,6,$B$11:$D$12)","v":"< 25"}]
[]
[]
[]
["Contenuto in calcare attivo (%)",null,null,"digitato"]
[null,null,null,{"$f":"Codici!W2","v":9},"proposte dal SILPA"]
["ID-Cal_att","min_att","max_att","contenuto","min","max"]
[1,0,1,"Basso",null,"< 1"]
[2,1,5,"Medio","=> 1","< 5"]
[3,5,7.5,"Elevato","=> 5","< 7,5"]
[4,7.5,100,"Molto elevato","=> 7,5"]
[null,"Criterio x ricerca ID_Cal_att e SILPA"]
[null,"cerca vert. Digitato"]
[null,"min_att","max_att","contenuto"]
[{"$f":"DGET($A$18:$F$22,1,$B$25:$D$26)","v":4},{"$f":"VLOOKUP(Codici!$W$2,$B$19:$D$22,1)","v":7.5},{"$f":"VLOOKUP(Codici!$W$2,$B$19:$D$22,2)","v":100},{"$f":"VLOOKUP(Codici!$W$2,$B$19:$D$22,3)","v":"Molto elevato"},{"$f":"DGET($A$18:$F$22,5,$B$25:$D$26)","v":"=> 7,5"},{"$f":"DGET($A$18:$F$22,6,$B$25:$D$26)","v":{"$error":"#VALUE!"}}]

{"sheet":"pH","index":35,"n_rows":12,"n_cols":4,"rows_kept":12,"cut":false,"hidden":true,"merged":[]}
["Reazione del terreno (pH in acqua)"]
["ID_pH","soglie","valori","classificazione"]
[1,0,"< 5,4","fortemente acido"]
[2,5.4,"da 5,4  a 6","acido"]
[3,6,"da 6,1  a 6,7","leggermente acido"]
[4,6.7,"da 6,8  a 7,3","neutro"]
[5,7.3,"da 7,4  a 8,1","leggermente alcalino"]
[6,8.1,"da 8,2  a 8,6","alcalino"]
[7,8.61," > 8,6","fortemente alcalino"]
[]
[null,null,null,"classificazione"]
[{"$f":"DGET(A2:D9,A2,D11:D12)","v":6},{"$f":"Inserimento!F23","v":8.3000000000000007},{"$f":"VLOOKUP(B12,$B$3:$D$9,2)","v":"da 8,2  a 8,6"},{"$f":"VLOOKUP($B$12,$B$3:$D$9,3)","v":"alcalino"}]

{"sheet":"Codici","index":36,"n_rows":2,"n_cols":126,"rows_kept":2,"cut":false,"hidden":false,"merged":[]}
["Azienda","Area","Appezz","Anno","ID_Met","Gruppo","Coltura","Fase","Modalità coltivaz.","Impianto_anni","Anticip","Resa_media","Resa_annua","ID_Cat_Col","C_tempo","S","A","Suolo","ID_Rag","pH","CaCO3","ID-Cal_tot","Attivo","ID-Cal_att","N","SO","ID_SO","ID_Min","ID:CN","ID_F_P","fosforo","ID_Gri_P","ID_M_K","ID_F_K","Potassio","ID_Gri_K","ID_M_Mg","CSC","ID_Dre","ID_C&D","ID_Pre","ID_MO","Prog_Cic_Fert1","ID_Fre","Q_N_MO","%N_fissa","ID_UBI","anni","Irrig","ZVN","Prog_Cic_fert2","sodo","Raccolta n° tagli",null,null,null,null,null,"Prog_Cic_Fert3",null,null,null,null,null,null,null,null,null,null,null,null,null,null,null,null,null,null,null,null,null,null,null,null,null,null,null,null,null,null,null,null,null,null,null,null,null,null,null,null,null,null,null,null,null,null,null,null,null,null,null,null,null,null,null,null,null,null,null,null,null,null,null,null,"Anno_F_org_1","Anno_F_org_2","Anno_F_org_3"]
[{"$f":"Inserimento!B5","v":"Pinco Pallino"},{"$f":"Inserimento!N5","v":"A"},{"$f":"Inserimento!Q5","v":1},{"$f":"Inserimento!T5","v":2019},1,5,20,6,2,null,true,{"$f":"Inserimento!C15","v":35},{"$f":"Inserimento!T10","v":4},2,{"$f":"C_tempo!C22","v":0.5},{"$f":"Inserimento!C19","v":10},{"$f":"Inserimento!C21","v":35},{"$f":"Suolo!B19","v":"FLA"},{"$f":"Suolo!E19","v":3},{"$f":"Inserimento!F23","v":8.3000000000000007},{"$f":"Inserimento!G25","v":16},{"$f":"Calcare!A12","v":3},{"$f":"Inserimento!G27","v":9},{"$f":"Calcare!A26","v":4},{"$f":"Inserimento!L19","v":0.9},{"$f":"Inserimento!L21","v":1.5},{"$f":"B!A19","v":10},{"$f":"B!J15","v":6},{"$f":"CN!A7","v":2},2,{"$f":"Inserimento!L26","v":41},{"$f":"Gri_P!A10","v":5},1,1,{"$f":"Inserimento!R19","v":385},{"$f":"Gri_K!A18","v":12},2,{"$f":"Inserimento!R26","v":0},1,{"$f":"'C&D'!F17","v":7},2,1,5,1,{"$f":"Inserimento!Q32","v":0},{"$f":"Inserimento!J15","v":0},2,{"$f":"Inserimento!C14","v":20},true,true,2,false,{"$f":"Inserimento!X10","v":2},null,null,null,null,null,5,null,null,null,null,null,null,null,null,null,null,null,null,null,null,null,null,null,null,null,null,null,null,null,null,null,null,null,null,null,null,null,null,null,null,null,null,null,null,null,null,null,null,null,null,null,null,null,null,null,null,null,null,null,null,null,null,null,null,null,null,null,null,null,null,{"$f":"Distribuz!Q7","v":0},{"$f":"Distribuz!Q10","v":0},{"$f":"Distribuz!Q13","v":0}]

{"sheet":"Work","index":37,"n_rows":0,"n_cols":0,"rows_kept":0,"cut":false,"hidden":true,"merged":[]}

{"sheet":"TRI1","index":38,"n_rows":104,"n_cols":104,"rows_kept":104,"cut":false,"hidden":true,"merged":[]}
[null,"C",null,"R",null,"E",null,"A",null,"Z",null,"I",null,"O",null,"N",null,"E"]
[]
[null,null,100,0]
[null,null,99,{"$f":"(D3+1)","v":1},{"$f":"(E$103-$C4)","v":0}]
[null,null,98,{"$f":"(D4+1)","v":2},1,{"$f":"(F$103-$C5)","v":0}]
[null,null,97,3,2,1,{"$f":"(G$103-$C6)","v":0}]
[null,null,96,4,3,2,1,{"$f":"(H$103-$C7)","v":0}]
[null,null,95,5,4,3,2,1,{"$f":"(I$103-$C8)","v":0}]
[null,null,94,6,5,4,3,2,1,{"$f":"(J$103-$C9)","v":0}]
[null,null,93,7,6,5,4,3,2,1,{"$f":"(K$103-$C10)","v":0}]
[null,null,92,8,7,6,5,4,3,2,1,{"$f":"(L$103-$C11)","v":0}]
[null,null,91,9,8,7,6,5,4,3,2,1,{"$f":"(M$103-$C12)","v":0}]
[null,null,90,10,9,8,7,6,5,4,3,2,1,{"$f":"(N$103-$C13)","v":0}]
[null,null,89,11,10,9,8,7,6,5,4,3,2,1,{"$f":"(O$103-$C14)","v":0}]
[null,null,88,12,11,10,9,8,7,6,5,4,3,2,1,{"$f":"(P$103-$C15)","v":0}]
[null,null,87,13,12,11,10,9,8,7,6,5,4,3,2,1,{"$f":"(Q$103-$C16)","v":0}]
[null,null,86,14,13,12,11,10,9,8,7,6,5,4,3,2,1,{"$f":"(R$103-$C17)","v":0}]
[null,null,85,15,14,13,12,11,10,9,8,7,6,5,4,3,2,1,{"$f":"(S$103-$C18)","v":0}]
[null,null,84,16,15,14,13,12,11,10,9,8,7,6,5,4,3,2,1,{"$f":"(T$103-$C19)","v":0}]
[null,null,83,17,16,15,14,13,12,11,10,9,8,7,6,5,4,3,2,1,{"$f":"(U$103-$C20)","v":0}]
[null,null,82,18,17,16,15,14,13,12,11,10,9,8,7,6,5,4,3,2,1,{"$f":"(V$103-$C21)","v":0}]
[null,null,81,19,18,17,16,15,14,13,12,11,10,9,8,7,6,5,4,3,2,1,{"$f":"(W$103-$C22)","v":0}]
[null,null,80,20,19,18,17,16,15,14,13,12,11,10,9,8,7,6,5,4,3,2,1,{"$f":"(X$103-$C23)","v":0}]
[null,null,79,21,20,19,18,17,16,15,14,13,12,11,10,9,8,7,6,5,4,3,2,1,{"$f":"(Y$103-$C24)","v":0}]
[null,null,78,22,21,20,19,18,17,16,15,14,13,12,11,10,9,8,7,6,5,4,3,2,1,{"$f":"(Z$103-$C25)","v":0}]
[null,null,77,23,22,21,20,19,18,17,16,15,14,13,12,11,10,9,8,7,6,5,4,3,2,1,{"$f":"(AA$103-$C26)","v":0}]
[null,null,76,24,23,22,21,20,19,18,17,16,15,14,13,12,11,10,9,8,7,6,5,4,3,2,1,{"$f":"(AB$103-$C27)","v":0}]
[null,null,75,25,24,23,22,21,20,19,18,17,16,15,14,13,12,11,10,9,8,7,6,5,4,3,2,1,{"$f":"(AC$103-$C28)","v":0}]
[null,null,74,26,25,24,23,22,21,20,19,18,17,16,15,14,13,12,11,10,9,8,7,6,5,4,3,2,1,{"$f":"(AD$103-$C29)","v":0}]
[null,null,73,27,26,25,24,23,22,21,20,19,18,17,16,15,14,13,12,11,10,9,8,7,6,5,4,3,2,1,{"$f":"(AE$103-$C30)","v":0}]
[null,null,72,28,27,26,25,24,23,22,21,20,19,18,17,16,15,14,13,12,11,10,9,8,7,6,5,4,3,2,1,{"$f":"(AF$103-$C31)","v":0}]
[null,null,71,29,28,27,26,25,24,23,22,21,20,19,18,17,16,15,14,13,12,11,10,9,8,7,6,5,4,3,2,1,{"$f":"(AG$103-$C32)","v":0}]
[null,null,70,30,29,28,27,26,25,24,23,22,21,20,19,18,17,16,15,14,13,12,11,10,9,8,7,6,5,4,3,2,1,{"$f":"(AH$103-$C33)","v":0}]
[null,null,69,31,30,29,28,27,26,25,24,23,22,21,20,19,18,17,16,15,14,13,12,11,10,9,8,7,6,5,4,3,2,{"$f":"(AH$103-$C34)","v":1},{"$f":"(AI$103-$C34)","v":0}]
[null,null,68,32,31,30,29,28,27,26,25,24,23,22,21,20,19,18,17,16,15,14,13,12,11,10,9,8,7,6,5,4,3,{"$f":"(AH$103-$C35)","v":2},{"$f":"(AI$103-$C35)","v":1},{"$f":"(AJ$103-$C35)","v":0}]
[null,null,67,33,{"$f":"(E$103-$C36)","v":32},31,30,29,28,27,26,25,24,23,22,21,20,19,18,17,16,15,14,13,12,11,10,9,8,7,6,5,4,{"$f":"(AH$103-$C36)","v":3},{"$f":"(AI$103-$C36)","v":2},{"$f":"(AJ$103-$C36)","v":1},{"$f":"(AK$103-$C36)","v":0}]
[null,null,66,34,33,{"$f":"(F$103-$C37)","v":32},31,30,29,28,27,26,25,24,23,22,21,20,19,18,17,16,15,14,13,12,11,10,9,8,7,6,5,{"$f":"(AH$103-$C37)","v":4},{"$f":"(AI$103-$C37)","v":3},{"$f":"(AJ$103-$C37)","v":2},{"$f":"(AK$103-$C37)","v":1},{"$f":"(AL$103-$C37)","v":0}]
[null,null,65,35,34,33,{"$f":"(G$103-$C38)","v":32},31,30,29,28,27,26,25,24,23,22,21,20,19,18,17,16,15,14,13,12,11,10,9,8,7,6,5,4,3,2,1,0]
[null,null,64,36,35,34,33,32,31,30,29,28,27,26,25,24,23,22,21,20,19,18,17,16,15,14,13,12,11,10,9,8,7,6,5,4,3,2,1,0]
[null,null,63,37,36,35,34,33,32,31,30,29,28,27,26,25,24,23,22,21,20,19,18,17,16,15,14,13,12,11,10,9,8,7,6,5,4,3,2,1,0]
[null,null,62,38,37,36,35,34,33,32,31,30,29,28,27,26,25,24,23,22,21,20,19,18,17,16,15,14,13,12,11,10,9,8,7,6,5,4,3,2,1,0]
[null,null,61,39,38,37,{"$f":"(G$103-$C42)","v":36},35,34,33,32,31,30,29,28,27,26,25,24,23,22,21,20,19,18,17,16,15,14,13,12,11,10,9,8,7,6,5,4,3,2,1,0]
[null,null,60,40,39,38,37,36,35,34,33,32,31,30,29,28,27,26,25,24,23,22,21,20,19,18,17,16,15,14,13,12,11,10,9,8,7,6,5,4,3,2,1,0]
[null,null,59,41,40,39,38,37,36,35,34,33,32,31,30,29,28,27,26,25,24,23,22,21,20,19,18,17,16,15,14,13,12,11,10,9,8,7,6,5,4,3,2,1,0]
[null,null,58,42,41,40,39,38,37,36,35,34,33,32,31,30,29,28,27,26,25,24,23,22,21,20,19,18,17,16,15,14,13,12,11,10,9,8,7,6,5,4,3,2,1,0]
[null,null,57,43,42,41,{"$f":"(G$103-$C46)","v":40},39,38,37,36,35,34,33,32,31,30,29,28,27,26,25,24,23,22,21,20,19,18,17,16,15,14,13,12,11,10,9,8,7,6,5,4,3,2,1,0]
[null,null,56,44,43,42,41,40,39,38,37,36,35,34,33,32,31,30,29,28,27,26,25,24,23,22,21,20,19,18,17,16,15,14,13,12,11,10,9,8,7,6,5,4,3,2,1,0]
[null,null,55,45,44,43,42,41,40,39,38,37,36,35,34,33,32,31,30,29,28,27,26,25,24,23,22,21,20,19,18,17,16,15,14,13,12,11,10,9,8,7,6,5,4,3,2,1,0]
[null,null,54,46,45,44,43,42,41,40,39,38,37,36,35,34,33,32,31,30,29,28,27,26,25,24,23,22,21,20,19,18,17,16,15,14,13,12,11,10,9,8,7,6,5,4,3,2,1,0]
[null,null,53,47,46,45,{"$f":"(G$103-$C50)","v":44},43,42,41,40,39,38,37,36,35,34,33,32,31,30,29,28,27,26,25,24,23,22,21,20,19,18,17,16,15,14,13,12,11,10,9,8,7,6,5,4,3,2,1,0]
[null,null,52,48,47,46,45,44,43,42,41,40,39,38,37,36,35,34,33,32,31,30,29,28,27,26,25,24,23,22,21,20,19,18,17,16,15,14,13,12,11,10,9,8,7,6,5,4,3,2,1,0]
[null,null,51,49,48,47,46,45,44,43,42,41,40,39,38,37,36,35,34,33,32,31,30,29,28,27,26,25,24,23,22,21,20,19,18,17,16,15,14,13,12,11,10,9,8,7,6,5,4,3,2,1,0]
[null,null,50,50,49,48,47,46,45,44,43,42,41,40,39,38,37,36,35,34,33,32,31,30,29,28,27,26,25,24,23,22,21,20,19,18,17,16,15,14,13,12,11,10,9,8,7,6,5,4,3,2,1,0]
[null,null,49,51,50,49,{"$f":"(G$103-$C54)","v":48},47,46,45,44,43,42,41,40,39,38,37,36,35,34,33,32,31,30,29,28,27,26,25,24,23,22,21,20,19,18,17,16,15,14,13,12,11,10,9,8,7,6,5,4,3,2,1,0]
[null,null,48,52,51,50,49,48,47,46,45,44,43,42,41,40,39,38,37,36,35,34,33,32,31,30,29,28,27,26,25,24,23,22,21,20,19,18,17,16,15,14,13,12,11,10,9,8,7,6,5,4,3,2,1,0]
[null,null,47,53,52,51,50,49,48,47,46,45,44,43,42,41,40,39,38,37,36,35,34,33,32,31,30,29,28,27,26,25,24,23,22,21,20,19,18,17,16,15,14,13,12,11,10,9,8,7,6,5,4,3,2,1,0]
[null,null,46,54,53,52,51,50,49,48,47,46,45,44,43,42,41,40,39,38,37,36,35,34,33,32,31,30,29,28,27,26,25,24,23,22,21,20,19,18,17,16,15,14,13,12,11,10,9,8,7,6,5,4,3,2,1,0]
[null,null,45,55,54,53,{"$f":"(G$103-$C58)","v":52},51,50,49,48,47,46,45,44,43,42,41,40,39,38,37,36,35,34,33,32,31,30,29,28,27,26,25,24,23,22,21,20,19,18,17,16,15,14,13,12,11,10,9,8,7,6,5,4,3,2,1,0]
[null,null,44,56,55,54,53,52,51,50,49,48,47,46,45,44,43,42,41,40,39,38,37,36,35,34,33,32,31,30,29,28,27,26,25,24,23,22,21,20,19,18,17,16,15,14,13,12,11,10,9,8,7,6,5,4,3,2,1,0]
[null,null,43,57,56,55,54,53,52,51,50,49,48,47,46,45,44,43,42,41,40,39,38,37,36,35,34,33,32,31,30,29,28,27,26,25,24,23,22,21,20,19,18,17,16,15,14,13,12,11,10,9,8,7,6,5,4,3,2,1,0]
[null,null,42,58,57,56,55,54,53,52,51,50,49,48,47,46,45,44,43,42,41,40,39,38,37,36,35,34,33,32,31,30,29,28,27,26,25,24,23,22,21,20,19,18,17,16,15,14,13,12,11,10,9,8,7,6,5,4,3,2,1,0]
[null,null,41,59,58,57,{"$f":"(G$103-$C62)","v":56},55,54,53,52,51,50,49,48,47,46,45,44,43,42,41,40,39,38,37,36,35,34,33,32,31,30,29,28,27,26,25,24,23,22,21,20,19,18,17,16,15,14,13,12,11,10,9,8,7,6,5,4,3,2,1,0]
[null,null,40,60,59,58,57,56,55,54,53,52,51,50,49,48,47,46,45,44,43,42,41,40,39,38,37,36,35,34,33,32,31,30,29,28,27,26,25,24,23,22,21,20,19,18,17,16,15,14,13,12,11,10,9,8,7,6,5,4,3,2,1,0]
[null,null,39,61,60,59,58,57,56,55,54,53,52,51,50,49,48,47,46,45,44,43,42,41,40,39,38,37,36,35,34,33,32,31,30,29,28,27,26,25,24,23,22,21,20,19,18,17,16,15,14,13,12,11,10,9,8,7,6,5,4,3,2,1,0]
[null,null,38,62,61,60,59,58,57,56,55,54,53,52,51,50,49,48,47,46,45,44,43,42,41,40,39,38,37,36,35,34,33,32,31,30,29,28,27,26,25,24,23,22,21,20,19,18,17,16,15,14,13,12,11,10,9,8,7,6,5,4,3,2,1,0]
[null,null,37,63,62,61,{"$f":"(G$103-$C66)","v":60},59,58,57,56,55,54,53,52,51,50,49,48,47,46,45,44,43,42,41,40,39,38,37,36,35,34,33,32,31,30,29,28,27,26,25,24,23,22,21,20,19,18,17,16,15,14,13,12,11,10,9,8,7,6,5,4,3,2,1,0]
[null,null,36,64,63,62,{"$f":"(G$103-$C67)","v":61},60,59,58,57,56,55,54,53,52,51,50,49,48,47,46,45,44,43,42,41,40,39,38,37,36,35,34,33,32,31,30,29,28,27,26,25,24,23,22,21,20,19,18,17,16,15,14,13,12,11,10,9,8,7,6,5,4,3,2,1,0]
[null,null,35,65,{"$f":"(E$103-$C68)","v":64},63,{"$f":"(G$103-$C68)","v":62},61,60,59,58,57,56,55,54,53,52,51,50,49,48,47,46,45,44,43,42,41,40,39,38,37,36,35,34,33,32,31,30,29,28,27,26,25,24,23,22,21,20,19,18,17,16,15,14,13,12,11,10,9,8,7,6,5,4,3,2,1,0]
[null,null,34,{"$f":"(D68+1)","v":66},65,{"$f":"(F$103-$C69)","v":64},63,62,61,60,59,58,57,56,55,54,53,52,51,50,49,48,47,46,45,44,43,42,41,40,39,38,37,36,35,34,33,32,31,30,29,28,27,26,25,24,23,22,21,20,19,18,17,16,15,14,13,12,11,10,9,8,7,6,5,4,3,2,1,0]
[null,null,33,67,66,65,64,63,62,61,60,59,58,57,56,55,54,53,52,51,50,49,48,47,46,45,44,43,42,41,40,39,38,37,36,35,34,33,32,31,30,29,28,27,26,25,24,23,22,21,20,19,18,17,16,15,14,13,12,11,10,9,8,7,6,5,4,3,2,1,{"$f":"(BS$103-$C70)","v":0}]
[null,null,32,68,67,66,65,64,63,62,61,60,59,58,57,56,55,54,53,52,51,50,49,48,47,46,45,44,43,42,41,40,39,38,37,36,35,34,33,32,31,30,29,28,27,26,25,24,23,22,21,20,19,18,17,16,15,14,13,12,11,10,9,8,7,6,5,4,3,{"$f":"(BR$103-$C71)","v":2},1,{"$f":"(BT$103-$C71)","v":0}]
[null,null,31,69,68,67,{"$f":"(G$103-$C72)","v":66},65,64,63,62,61,60,59,58,57,56,55,54,53,52,51,50,49,48,47,46,45,44,43,42,41,40,39,38,37,36,35,34,33,32,31,30,29,28,27,26,25,24,23,22,21,20,19,18,17,16,15,14,13,12,11,10,9,8,7,6,5,4,3,2,1,{"$f":"(BU$103-$C72)","v":0}]
[null,null,30,70,69,68,67,66,65,64,63,62,61,60,59,58,57,56,55,54,53,52,51,50,49,48,47,46,45,44,43,42,41,40,39,38,37,36,35,34,33,32,31,30,29,28,27,26,25,24,23,22,21,20,19,18,17,16,15,14,13,12,11,10,9,8,7,6,5,4,3,2,1,{"$f":"(BV$103-$C73)","v":0}]
[null,null,29,71,70,69,68,67,66,65,64,63,62,61,60,59,58,57,56,55,54,53,52,51,50,49,48,47,46,45,44,43,42,41,40,39,38,37,36,35,34,33,32,31,30,29,28,27,26,25,24,23,22,21,20,19,18,17,16,15,14,13,12,11,10,9,8,7,6,5,4,3,2,1,{"$f":"(BW$103-$C74)","v":0}]
[null,null,28,72,71,70,69,68,67,66,65,64,63,62,61,60,59,58,57,56,55,54,53,52,51,50,49,48,47,46,45,44,43,42,41,40,39,38,37,36,35,34,33,32,31,30,29,28,27,26,25,24,23,22,21,20,19,18,17,16,15,14,13,12,11,10,9,8,7,{"$f":"(BR$103-$C75)","v":6},5,4,3,2,1,{"$f":"(BX$103-$C75)","v":0}]
[null,null,27,73,72,71,{"$f":"(G$103-$C76)","v":70},69,68,67,66,65,64,63,62,61,60,59,58,57,56,55,54,53,52,51,50,49,48,47,46,45,44,43,42,41,40,39,38,37,36,35,34,33,32,31,30,29,28,27,26,25,24,23,22,21,20,19,18,17,16,15,14,13,12,11,10,9,8,7,6,5,4,3,2,1,{"$f":"(BY$103-$C76)","v":0}]
[null,null,26,74,73,72,71,70,69,68,67,66,65,64,63,62,61,60,59,58,57,56,55,54,53,52,51,50,49,48,47,46,45,44,43,42,41,40,39,38,37,36,35,34,33,32,31,30,29,28,27,26,25,24,23,22,21,20,19,18,17,16,15,14,13,12,11,10,9,8,7,6,5,4,3,2,1,{"$f":"(BZ$103-$C77)","v":0}]
[null,null,25,75,74,73,72,71,70,69,68,67,66,65,64,63,62,61,60,59,58,57,56,55,54,53,52,51,50,49,48,47,46,45,44,43,42,41,40,39,38,37,36,35,34,33,32,31,30,29,28,27,26,25,24,23,22,21,20,19,18,17,16,15,14,13,12,11,10,9,8,7,6,5,4,3,2,1,{"$f":"(CA$103-$C78)","v":0}]
[null,null,24,76,75,74,73,72,71,70,69,68,67,66,65,64,63,62,61,60,59,58,57,56,55,54,53,52,51,50,49,48,47,46,45,44,43,42,41,40,39,38,37,36,35,34,33,32,31,30,29,28,27,26,25,24,23,22,21,20,19,18,17,16,15,14,13,12,11,{"$f":"(BR$103-$C79)","v":10},9,8,7,6,5,4,3,2,1,{"$f":"(CB$103-$C79)","v":0}]
[null,null,23,77,76,75,{"$f":"(G$103-$C80)","v":74},73,72,71,70,69,68,67,66,65,64,63,62,61,60,59,58,57,56,55,54,53,52,51,50,49,48,47,46,45,44,43,42,41,40,39,38,37,36,35,34,33,32,31,30,29,28,27,26,25,24,23,22,21,20,19,18,17,16,15,14,13,12,11,10,9,8,7,6,5,4,3,2,1,{"$f":"(CC$103-$C80)","v":0}]
[null,null,22,78,77,76,75,74,73,72,71,70,69,68,67,66,65,64,63,62,61,60,59,58,57,56,55,54,53,52,51,50,49,48,47,46,45,44,43,42,41,40,39,38,37,36,35,34,33,32,31,30,29,28,27,26,25,24,23,22,21,20,19,18,17,16,15,14,13,12,11,10,9,8,7,6,5,4,3,2,1,{"$f":"(CD$103-$C81)","v":0}]
[null,null,21,79,78,77,76,75,74,73,72,71,70,69,68,67,66,65,64,63,62,61,60,59,58,57,56,55,54,53,52,51,50,49,48,47,46,45,44,43,42,41,40,39,38,37,36,35,34,33,32,31,30,29,28,27,26,25,24,23,22,21,20,19,18,17,16,15,14,13,12,11,10,9,8,7,6,5,4,3,2,1,{"$f":"(CE$103-$C82)","v":0}]
[null,null,20,80,79,78,77,76,75,74,73,72,71,70,69,68,67,66,65,64,63,62,61,60,59,58,57,56,55,54,53,52,51,50,49,48,47,46,45,44,43,42,41,40,39,38,37,36,35,34,33,32,31,30,29,28,27,26,25,24,23,22,21,20,19,18,17,16,15,{"$f":"(BR$103-$C83)","v":14},13,12,11,10,9,8,7,6,5,4,3,2,{"$f":"(CE$103-$C83)","v":1},{"$f":"(CF$103-$C83)","v":0}]
[null,null,19,81,80,79,{"$f":"(G$103-$C84)","v":78},77,76,75,74,73,72,71,70,69,68,67,66,65,64,63,62,61,60,59,58,57,56,55,54,53,52,51,50,49,48,47,46,45,44,43,42,41,40,39,38,37,36,35,34,33,32,31,30,29,28,27,26,25,24,23,22,21,20,19,18,17,16,15,14,13,12,11,10,9,8,7,6,5,4,3,{"$f":"(CE$103-$C84)","v":2},{"$f":"(CF$103-$C84)","v":1},{"$f":"(CG$103-$C84)","v":0}]
[null,null,18,82,81,80,79,78,77,76,75,74,73,72,71,70,69,68,67,66,65,64,63,62,61,60,59,58,57,56,55,54,53,52,51,50,49,48,47,46,45,44,43,42,41,40,39,38,37,36,35,34,33,32,31,30,29,28,27,26,25,24,23,22,21,20,19,18,17,16,15,14,13,12,11,10,9,8,7,6,5,4,{"$f":"(CE$103-$C85)","v":3},{"$f":"(CF$103-$C85)","v":2},{"$f":"(CG$103-$C85)","v":1},{"$f":"(CH$103-$C85)","v":0}]
[null,null,17,83,82,81,80,79,78,77,76,75,74,73,72,71,70,69,68,67,66,65,64,63,62,61,60,59,58,57,56,55,54,53,52,51,50,49,48,47,46,45,44,43,42,41,40,39,38,37,36,35,34,33,32,31,30,29,28,27,26,25,24,23,22,21,20,19,18,17,16,15,14,13,12,11,10,9,8,7,6,5,{"$f":"(CE$103-$C86)","v":4},{"$f":"(CF$103-$C86)","v":3},{"$f":"(CG$103-$C86)","v":2},{"$f":"(CH$103-$C86)","v":1},{"$f":"(CI$103-$C86)","v":0}]
[null,null,16,84,83,82,81,80,79,78,77,76,75,74,73,72,71,70,69,68,67,66,65,64,63,62,61,60,59,58,57,56,55,54,53,52,51,50,49,48,47,46,45,44,43,42,41,40,39,38,37,36,35,34,33,32,31,30,29,28,27,26,25,24,23,22,21,20,19,{"$f":"(BR$103-$C87)","v":18},17,16,15,14,13,12,11,10,9,8,7,6,5,4,3,2,1,0]
[null,null,15,85,84,83,{"$f":"(G$103-$C88)","v":82},81,80,79,78,77,76,75,74,73,72,71,70,69,68,67,66,65,64,63,62,61,60,59,58,57,56,55,54,53,52,51,50,49,48,47,46,45,44,43,42,41,40,39,38,37,36,35,34,33,32,31,30,29,28,27,26,25,24,23,22,21,20,19,18,17,16,15,14,13,12,11,10,9,8,7,6,5,4,3,2,1,0]
[null,null,14,86,85,84,83,82,81,80,79,78,77,76,75,74,73,72,71,70,69,68,67,66,65,64,63,62,61,60,59,58,57,56,55,54,53,52,51,50,49,48,47,46,45,44,43,42,41,40,39,38,37,36,35,34,33,32,31,30,29,28,27,26,25,24,23,22,21,20,19,18,17,16,15,14,13,12,11,10,9,8,7,6,5,4,3,2,1,0]
[null,null,13,87,86,85,84,83,82,81,80,79,78,77,76,75,74,73,72,71,70,69,68,67,66,65,64,63,62,61,60,59,58,57,56,55,54,53,52,51,50,49,48,47,46,45,44,43,42,41,40,39,38,37,36,35,34,33,32,31,30,29,28,27,26,25,24,23,22,21,20,19,18,17,16,15,14,13,12,11,10,9,8,7,6,5,4,3,2,1,0]
[null,null,12,88,87,86,85,84,83,82,81,80,79,78,77,76,75,74,73,72,71,70,69,68,67,66,65,64,63,62,61,60,59,58,57,56,55,54,53,52,51,50,49,48,47,46,45,44,43,42,41,40,39,38,37,36,35,34,33,32,31,30,29,28,27,26,25,24,23,{"$f":"(BR$103-$C91)","v":22},21,20,19,18,17,16,15,14,13,12,11,10,9,8,7,6,5,4,3,2,1,0]
[null,null,11,89,88,87,{"$f":"(G$103-$C92)","v":86},85,84,83,82,81,80,79,78,77,76,75,74,73,72,71,70,69,68,67,66,65,64,63,62,61,60,59,58,57,56,55,54,53,52,51,50,49,48,47,46,45,44,43,42,41,40,39,38,37,36,35,34,33,32,31,30,29,28,27,26,25,24,23,22,21,20,19,18,17,16,15,14,13,12,11,10,9,8,7,6,5,4,3,2,1,0]
[null,null,10,90,89,88,87,86,85,84,83,82,81,80,79,78,77,76,75,74,73,72,71,70,69,68,67,66,65,64,63,62,61,60,59,58,57,56,55,54,53,52,51,50,49,48,47,46,45,44,43,42,41,40,39,38,37,36,35,34,33,32,31,30,29,28,27,26,25,24,23,22,21,20,19,18,17,16,15,14,13,12,11,10,9,8,7,6,5,4,3,2,1,0]
[null,null,9,91,90,89,88,87,86,85,84,83,82,81,80,79,78,77,76,75,74,73,72,71,70,69,68,67,66,65,64,63,62,61,60,59,58,57,56,55,54,53,52,51,50,49,48,47,46,45,44,43,42,41,40,39,38,37,36,35,34,33,32,31,30,29,28,27,26,25,24,23,22,21,20,19,18,17,16,15,14,13,12,11,10,9,8,7,6,5,4,3,2,1,0]
[null,null,8,92,91,90,89,88,87,86,85,84,83,82,81,80,79,78,77,76,75,74,73,72,71,70,69,68,67,66,65,64,63,62,61,60,59,58,57,56,55,54,53,52,51,50,49,48,47,46,45,44,43,42,41,40,39,38,37,36,35,34,33,32,31,30,29,28,27,{"$f":"(BR$103-$C95)","v":26},25,24,23,22,21,20,19,18,17,16,15,14,13,12,11,10,9,8,7,6,5,4,3,2,1,0]
[null,null,7,93,92,91,{"$f":"(G$103-$C96)","v":90},89,88,87,86,85,84,83,82,81,80,79,78,77,76,75,74,73,72,71,70,69,68,67,66,65,64,63,62,61,60,59,58,57,56,55,54,53,52,51,50,49,48,47,46,45,44,43,42,41,40,39,38,37,36,35,34,33,32,31,30,29,28,27,26,25,24,23,22,21,20,19,18,17,16,15,14,13,12,11,10,9,8,7,6,5,4,3,2,1,0]
["A",null,6,94,93,92,91,90,89,88,87,86,85,84,83,82,81,80,79,78,77,76,75,74,73,72,71,70,69,68,67,66,65,64,63,62,61,60,59,58,57,56,55,54,53,52,51,50,49,48,47,46,45,44,43,42,41,40,39,38,37,36,35,34,33,32,31,30,29,28,27,26,25,24,23,22,21,20,19,18,17,16,15,14,13,12,11,10,9,8,7,6,5,4,3,2,1,0]
["L",null,5,95,94,93,92,91,90,89,88,87,86,85,84,83,82,81,80,79,78,77,76,75,74,73,72,71,70,69,68,67,66,65,64,63,62,61,60,59,58,57,56,55,54,53,52,51,50,49,48,47,46,45,44,43,42,41,40,39,38,37,36,35,34,33,32,31,30,29,28,27,26,25,24,23,22,21,20,19,18,17,16,15,14,13,12,11,10,9,8,7,6,5,4,3,2,1,0]
["L",null,4,96,95,94,93,92,91,90,89,88,87,86,85,84,83,82,81,80,79,78,77,76,75,74,73,72,71,70,69,68,67,66,65,64,63,62,61,60,59,58,57,56,55,54,53,52,51,50,49,48,47,46,45,44,43,42,41,40,39,38,37,36,35,34,33,32,31,{"$f":"(BR$103-$C99)","v":30},29,28,27,26,25,24,23,22,21,20,19,18,17,16,15,14,13,12,11,10,9,8,7,6,5,4,3,2,1,0]
["I",null,3,97,96,95,{"$f":"(G$103-$C100)","v":94},93,92,91,90,89,88,87,86,85,84,83,82,81,80,79,78,77,76,75,74,73,72,71,70,69,68,67,66,65,64,63,62,61,60,59,58,57,56,55,54,53,52,51,50,49,48,47,46,45,44,43,42,41,40,39,38,37,36,35,34,33,32,31,30,29,28,27,26,25,24,23,22,21,20,19,18,17,16,15,14,13,12,11,10,9,8,7,6,5,4,3,2,1,0]
["G",null,2,98,97,96,95,94,93,92,91,90,89,88,87,86,85,84,83,82,81,80,79,78,77,76,75,74,73,72,71,70,69,68,67,66,65,64,63,62,61,60,59,58,57,56,55,54,53,52,51,50,49,48,47,46,45,44,43,42,41,40,39,38,37,36,35,34,33,32,31,30,29,28,27,26,25,24,23,22,21,20,19,18,17,16,15,14,13,12,11,10,9,8,7,6,5,4,3,2,1,0]
["R",null,1,99,{"$f":"(E103-$C102)","v":98},{"$f":"(F103-$C102)","v":97},96,95,94,93,92,91,90,89,88,87,86,85,84,83,82,81,80,79,78,77,76,75,74,73,72,71,70,69,68,67,66,65,64,63,62,61,60,59,58,57,56,55,54,53,52,51,50,49,48,47,46,45,44,43,42,41,40,39,38,37,36,35,34,{"$f":"(BR103-$C102)","v":33},32,31,30,29,28,27,26,25,24,23,22,21,20,19,18,17,16,15,14,13,12,11,10,9,8,7,6,5,4,3,2,1,0]
["A",null,0,100,{"$f":"(100-E104)","v":99},{"$f":"(100-F104)","v":98},97,96,95,94,93,92,91,90,89,88,87,86,85,84,83,82,81,80,79,78,77,76,75,74,73,72,71,70,69,68,67,66,65,64,63,62,61,60,59,58,57,56,55,54,53,52,51,50,49,48,47,46,45,44,43,42,41,40,39,38,37,36,35,{"$f":"(100-BR104)","v":34},33,32,31,30,29,28,27,26,25,24,23,22,21,20,19,18,17,16,15,14,13,12,11,10,9,8,7,6,5,4,3,2,1,0]
[null,"SABBIA",null,0,1,2,3,4,5,6,7,8,9,10,11,12,13,14,15,16,17,18,19,20,21,22,23,24,25,26,27,28,29,30,31,32,33,34,35,36,37,38,39,40,41,42,43,44,45,46,47,48,49,50,51,52,53,54,55,56,57,58,59,60,61,62,63,64,65,66,67,68,69,70,71,72,73,74,75,76,77,78,79,80,81,82,83,84,85,86,87,88,89,90,91,92,93,94,95,96,97,98,99,100]

{"sheet":"TRI2","index":39,"n_rows":106,"n_cols":104,"rows_kept":106,"cut":false,"hidden":true,"merged":[]}
[null,"Riga Matrice","ARGILLA","N",null,"u",null,"m",null,"e",null,"r",null,"o"]
[null,null,null,0,1,2,3,4,5,6,7,8,9,10,11,12,13,14,15,16,17,18,19,20,21,22,23,24,25,26,27,28,29,30,31,32,33,34,35,36,37,38,39,40,41,42,43,44,45,46,47,48,49,50,51,52,53,54,55,56,57,58,59,60,61,62,63,64,65,66,67,68,69,70,71,72,73,74,75,76,77,78,79,80,81,82,83,84,85,86,87,88,89,90,91,92,93,94,95,96,97,98,99,100]
[null,1,100,12]
[null,{"$f":"(B3+1)","v":2},99,12,12]
[null,{"$f":"(B4+1)","v":3},98,12,12,12]
[null,4,97,12,12,12,12]
[null,5,96,12,12,12,12,12]
[null,6,95,12,12,12,12,12,12]
[null,7,94,12,12,12,12,12,12,12]
[null,8,93,12,12,12,12,12,12,12,12]
[null,9,92,12,12,12,12,12,12,12,12,12]
[null,10,91,12,12,12,12,12,12,12,12,12,12]
[null,11,90,12,12,12,12,12,12,12,12,12,12,12]
[null,12,89,12,12,12,12,12,12,12,12,12,12,12,12]
[null,13,88,12,12,12,12,12,12,12,12,12,12,12,12,12]
[null,14,87,12,12,12,12,12,12,12,12,12,12,12,12,12,12]
[null,15,86,12,12,12,12,12,12,12,12,12,12,12,12,12,12,12]
[null,16,85,12,12,12,12,12,12,12,12,12,12,12,12,12,12,12,12]
[null,17,84,12,12,12,12,12,12,12,12,12,12,12,12,12,12,12,12,12]
[null,18,83,12,12,12,12,12,12,12,12,12,12,12,12,12,12,12,12,12,12]
[null,19,82,12,12,12,12,12,12,12,12,12,12,12,12,12,12,12,12,12,12,12]
[null,20,81,12,12,12,12,12,12,12,12,12,12,12,12,12,12,12,12,12,12,12,12]
[null,21,80,12,12,12,12,12,12,12,12,12,12,12,12,12,12,12,12,12,12,12,12,12]
[null,22,79,12,12,12,12,12,12,12,12,12,12,12,12,12,12,12,12,12,12,12,12,12,12]
[null,23,78,12,12,12,12,12,12,12,12,12,12,12,12,12,12,12,12,12,12,12,12,12,12,12]
[null,24,77,12,12,12,12,12,12,12,12,12,12,12,12,12,12,12,12,12,12,12,12,12,12,12,12]
[null,25,76,12,12,12,12,12,12,12,12,12,12,12,12,12,12,12,12,12,12,12,12,12,12,12,12,12]
[null,26,75,12,12,12,12,12,12,12,12,12,12,12,12,12,12,12,12,12,12,12,12,12,12,12,12,12,12]
[null,27,74,12,12,12,12,12,12,12,12,12,12,12,12,12,12,12,12,12,12,12,12,12,12,12,12,12,12,12]
[null,28,73,12,12,12,12,12,12,12,12,12,12,12,12,12,12,12,12,12,12,12,12,12,12,12,12,12,12,12,12]
[null,29,72,12,12,12,12,12,12,12,12,12,12,12,12,12,12,12,12,12,12,12,12,12,12,12,12,12,12,12,12,12]
[null,30,71,12,12,12,12,12,12,12,12,12,12,12,12,12,12,12,12,12,12,12,12,12,12,12,12,12,12,12,12,12,12]
[null,31,70,12,12,12,12,12,12,12,12,12,12,12,12,12,12,12,12,12,12,12,12,12,12,12,12,12,12,12,12,12,12,12]
[null,32,69,12,12,12,12,12,12,12,12,12,12,12,12,12,12,12,12,12,12,12,12,12,12,12,12,12,12,12,12,12,12,12,12]
[null,33,68,12,12,12,12,12,12,12,12,12,12,12,12,12,12,12,12,12,12,12,12,12,12,12,12,12,12,12,12,12,12,12,12,12]
[null,34,67,12,12,12,12,12,12,12,12,12,12,12,12,12,12,12,12,12,12,12,12,13,12,12,12,12,12,12,12,12,12,12,12,12,12]
[null,35,66,12,12,12,12,12,12,12,12,12,12,12,12,12,12,12,12,12,12,12,12,12,12,12,12,12,12,12,12,12,12,12,12,12,12,12]
[null,36,65,12,12,12,12,12,12,12,12,12,12,12,12,12,12,12,12,12,12,12,12,12,12,12,12,12,12,12,12,12,12,12,12,12,12,12,12]
[null,37,64,12,12,12,12,12,12,12,12,12,12,12,12,12,12,12,12,12,12,12,12,12,12,12,12,12,12,12,12,12,12,12,12,12,12,12,12,12]
[null,38,63,12,12,12,12,12,12,12,12,12,12,12,12,12,12,12,12,12,12,12,12,12,12,12,12,12,12,12,12,12,12,12,12,12,12,12,12,12,12]
[null,39,62,12,12,12,12,12,12,12,12,12,12,12,12,12,12,12,12,12,12,12,12,12,12,12,12,12,12,12,12,12,12,12,12,12,12,12,12,12,12,12]
[null,40,61,12,12,12,12,12,12,12,12,12,12,12,12,12,12,12,12,12,12,12,12,12,12,12,12,12,12,12,12,12,12,12,12,12,12,12,12,12,12,12,12]
[null,41,60,11,12,12,12,12,12,12,12,12,12,12,12,12,12,12,12,12,12,12,12,12,12,12,12,12,12,12,12,12,12,12,12,12,12,12,12,12,12,12,12,12]
[null,42,59,11,11,12,12,12,12,12,12,12,12,12,12,12,12,12,12,12,12,12,12,12,12,12,12,12,12,12,12,12,12,12,12,12,12,12,12,12,12,12,12,12,12]
[null,43,58,11,11,11,12,12,12,12,12,12,12,12,12,12,12,12,12,12,12,12,12,12,12,12,12,12,12,12,12,12,12,12,12,12,12,12,12,12,12,12,12,12,12,12]
[null,44,57,11,11,11,11,12,12,12,12,12,12,12,12,12,12,12,12,12,12,12,12,12,12,12,12,12,12,12,12,12,12,12,12,12,12,12,12,12,12,12,12,12,12,12,12]
[null,45,56,11,11,11,11,11,12,12,12,12,12,12,12,12,12,12,12,12,12,12,12,12,12,12,12,12,12,12,12,12,12,12,12,12,11,12,12,12,12,12,12,12,12,12,12,12]
[null,46,55,11,11,11,11,11,11,12,12,12,12,12,12,12,12,12,12,12,12,12,12,12,12,12,12,12,12,12,12,12,12,12,12,13,12,12,12,12,12,12,12,12,12,12,12,12,12]
[null,47,54,11,11,11,11,11,11,11,12,12,12,12,12,12,12,12,12,12,12,12,12,12,12,12,12,12,12,12,12,12,12,12,12,12,12,12,12,12,12,12,12,12,12,12,12,12,12,10]
[null,48,53,11,11,11,11,11,11,11,11,12,12,12,12,12,12,12,12,12,12,12,12,12,12,12,12,12,12,12,12,12,12,12,12,12,12,12,12,12,12,12,12,12,12,12,12,12,12,10,10]
[null,49,52,11,11,11,11,11,11,11,11,11,12,12,12,12,12,12,12,12,12,12,12,12,12,12,12,12,12,12,12,12,12,12,12,12,12,12,12,12,12,12,12,12,12,12,12,12,12,10,10,10]
[null,50,51,11,11,11,11,11,11,11,11,11,11,12,12,12,12,12,12,12,12,12,12,12,12,12,12,12,12,12,12,12,12,12,12,12,12,12,12,12,12,12,12,12,12,12,12,12,12,10,10,10,10]
[null,51,50,11,11,11,11,11,11,11,11,11,11,11,12,12,12,12,12,12,12,12,12,12,12,12,12,12,12,12,12,12,12,12,12,12,12,12,12,12,12,12,12,12,12,12,12,12,12,10,10,10,10,10]
[null,52,49,11,11,11,11,11,11,11,11,11,11,11,11,12,12,12,12,12,12,12,12,12,12,12,12,12,12,12,12,12,12,12,12,12,12,12,12,12,12,12,12,12,12,12,12,12,12,10,10,10,10,10,10]
[null,53,48,11,11,11,11,11,11,11,11,11,11,11,11,11,12,12,12,12,12,12,12,12,12,12,12,12,12,12,12,12,12,12,12,12,12,12,12,12,12,12,12,12,12,12,12,12,12,10,10,10,10,10,10,10]
[null,54,47,11,11,11,11,11,11,11,11,11,11,11,11,11,11,12,12,12,12,12,12,12,12,12,12,12,12,12,12,12,12,12,12,12,12,12,12,12,12,12,12,12,12,12,12,12,12,10,10,10,10,10,10,10,10]
[null,55,46,11,11,11,11,11,11,11,11,11,11,11,11,11,11,11,12,12,12,12,12,12,12,12,12,12,12,12,12,12,12,12,12,12,12,12,12,12,12,12,12,12,12,12,12,12,12,10,10,10,10,10,10,10,10,10]
[null,56,45,11,11,11,11,11,11,11,11,11,11,11,11,11,11,11,11,12,12,12,12,12,12,12,12,12,12,12,12,12,12,12,12,12,12,12,12,12,12,12,12,12,12,12,12,12,12,10,10,10,10,10,10,10,10,10,10]
[null,57,44,11,11,11,11,11,11,11,11,11,11,11,11,11,11,11,11,11,12,12,12,12,12,12,12,12,12,12,12,12,12,12,12,12,12,12,12,12,12,12,12,12,12,12,12,12,12,10,10,10,10,10,10,10,10,10,10,10]
[null,58,43,11,11,11,11,11,11,11,11,11,11,11,11,11,11,11,11,11,11,12,12,12,12,12,12,12,12,12,12,12,12,12,12,12,12,12,12,12,12,12,12,12,12,12,12,12,12,10,10,10,10,10,10,10,10,10,10,10,10]
[null,59,42,11,11,11,11,11,11,11,11,11,11,11,11,11,11,11,11,11,11,11,12,12,12,12,12,12,12,12,12,12,12,12,12,12,12,12,12,12,12,12,12,12,12,12,12,12,12,10,10,10,10,10,10,10,10,10,10,10,10,10]
[null,60,41,11,11,11,11,11,11,11,11,11,11,11,11,11,11,11,11,11,11,11,11,12,12,12,12,12,12,12,12,12,12,12,12,12,12,12,12,12,12,12,12,12,12,12,12,12,12,10,10,10,10,10,10,10,10,10,10,10,10,10,10]
[null,61,40,9,9,9,9,9,9,9,9,9,9,9,9,9,9,9,9,9,9,9,9,9,8,8,8,8,8,8,8,8,8,8,8,8,8,8,8,8,8,8,8,8,8,8,8,8,8,10,10,10,10,10,10,10,10,10,10,10,10,10,10,10]
[null,62,39,9,9,9,9,9,9,9,9,9,9,9,9,9,9,9,9,9,9,9,9,9,8,8,8,8,8,8,8,8,8,8,8,8,8,8,8,8,8,8,8,8,8,8,8,8,8,10,10,10,10,10,10,10,10,10,10,10,10,10,10,10,10]
[null,63,38,9,9,9,9,9,9,9,9,9,9,9,9,9,9,9,9,9,9,9,9,9,8,8,8,8,8,8,8,8,8,8,8,8,8,8,8,8,8,8,8,8,8,8,8,8,8,10,10,10,10,10,10,10,10,10,10,10,10,10,10,10,10,10]
[null,64,37,9,9,9,9,9,9,9,9,9,9,9,9,9,9,9,9,9,9,9,9,9,8,8,8,8,8,8,8,8,8,8,8,8,8,8,8,8,8,8,8,8,8,8,8,8,8,10,10,10,10,10,10,10,10,10,10,10,10,10,10,10,10,10,10]
[null,65,36,9,9,9,9,9,9,9,9,9,9,9,9,9,9,9,9,9,9,9,9,9,8,8,8,8,8,8,8,8,8,8,8,8,8,8,8,8,8,8,8,8,8,8,8,8,8,10,10,10,10,10,10,10,10,10,10,10,10,10,10,10,10,10,10,10]
[null,66,35,9,9,9,9,9,9,9,9,9,9,9,9,9,9,9,9,9,9,9,9,9,8,8,8,8,8,8,8,8,8,8,8,8,8,8,8,8,8,8,8,8,8,8,8,8,8,10,10,10,10,10,10,10,10,10,10,10,10,10,10,10,10,10,10,10,10]
[null,{"$f":"(B68+1)","v":67},34,9,9,9,9,9,9,9,9,9,9,9,9,9,9,9,9,9,9,9,9,9,8,8,8,8,8,8,8,8,8,8,8,8,8,8,8,8,8,8,8,8,8,8,8,8,8,7,7,7,7,7,7,7,7,7,7,7,7,7,7,7,7,7,7,7,7,7]
[null,68,33,9,9,9,9,9,9,9,9,9,9,9,9,9,9,9,9,9,9,9,9,9,8,8,8,8,8,8,8,8,8,8,8,8,8,8,8,8,8,8,8,8,8,8,8,8,8,7,7,7,7,7,7,7,7,7,7,7,7,7,7,7,7,7,7,7,7,7,7]
[null,69,32,9,9,9,9,9,9,9,9,9,9,9,9,9,9,9,9,9,9,9,9,9,8,8,8,8,8,8,8,8,8,8,8,8,8,8,8,8,8,8,8,8,8,8,8,8,8,7,7,7,7,7,7,7,7,7,7,7,7,7,7,7,7,7,7,7,7,7,1,7]
[null,70,31,9,9,9,9,9,9,9,9,9,9,9,9,9,9,9,9,9,9,9,9,9,8,8,8,8,8,8,8,8,8,8,8,8,8,8,8,8,8,8,8,8,8,8,8,8,8,7,7,7,7,7,7,7,7,7,7,7,7,7,7,7,7,7,7,7,7,7,2,1,7]
[null,71,30,9,9,9,9,9,9,9,9,9,9,9,9,9,9,9,9,9,9,9,9,9,8,8,8,8,8,8,8,8,8,8,8,8,8,8,8,8,8,8,8,8,8,8,8,8,8,7,7,7,7,7,7,7,7,7,7,7,7,7,7,7,7,7,7,7,7,7,3,2,1,7]
[null,72,29,9,9,9,9,9,9,9,9,9,9,9,9,9,9,9,9,9,9,9,9,9,8,8,8,8,8,8,8,8,8,8,8,8,8,8,8,8,8,8,8,8,8,8,8,8,8,7,7,7,7,7,7,7,7,7,7,7,7,7,7,7,7,7,7,7,7,7,7,7,7,7,7]
[null,73,28,9,9,9,9,9,9,9,9,9,9,9,9,9,9,9,9,9,9,9,9,9,8,8,8,8,8,8,8,8,8,8,8,8,8,8,8,8,8,8,8,8,8,8,8,8,8,7,7,7,7,7,7,7,7,7,7,7,7,7,7,7,7,7,7,7,7,7,7,7,7,7,7,7]
[null,74,27,6,6,6,6,6,6,6,6,6,6,6,6,6,6,6,6,6,6,6,6,6,6,6,6,5,5,5,5,5,5,5,5,5,5,5,5,5,5,5,5,5,5,5,5,5,5,5,7,7,7,7,7,7,7,7,7,7,7,7,7,7,7,7,7,7,7,7,7,7,7,7,7,7,7]
[null,75,26,6,6,6,6,6,6,6,6,6,6,6,6,6,6,6,6,6,6,6,6,6,6,6,6,6,5,5,5,5,5,5,5,5,5,5,5,5,5,5,5,5,5,5,5,5,5,5,5,7,7,7,7,7,7,7,7,7,7,7,7,7,7,7,7,7,7,7,7,7,7,7,7,7,7,7]
[null,76,25,6,6,6,6,6,6,6,6,6,6,6,6,6,6,6,6,6,6,6,6,6,6,6,6,6,6,5,5,5,5,5,5,5,5,5,5,5,5,5,5,5,5,5,5,5,5,5,5,5,7,7,7,7,7,7,7,7,7,7,7,7,7,7,7,7,7,7,7,7,7,7,7,7,7,7,7]
[null,77,24,6,6,6,6,6,6,6,6,6,6,6,6,6,6,6,6,6,6,6,6,6,6,6,6,6,6,6,5,5,5,5,5,5,5,5,5,5,5,5,5,5,5,5,5,5,5,5,5,5,5,7,7,7,7,7,7,7,7,7,7,7,7,7,7,7,7,7,7,7,7,7,7,7,7,7,7,7]
[null,78,23,6,6,6,6,6,6,6,6,6,6,6,6,6,6,6,6,6,6,6,6,6,6,6,6,6,6,6,6,5,5,5,5,5,5,5,5,5,5,5,5,5,5,5,5,5,5,5,5,5,5,5,7,7,7,7,7,7,7,7,7,7,7,7,7,7,7,7,7,7,7,7,7,7,7,7,7,7,7]
[null,79,22,6,6,6,6,6,6,6,6,6,6,6,6,6,6,6,6,6,6,6,6,6,6,6,6,6,6,6,51,6,5,5,5,5,5,5,5,5,5,5,5,5,5,5,5,5,5,5,5,5,5,5,5,7,7,7,7,7,7,7,7,7,7,7,7,7,7,7,7,7,7,7,7,7,7,7,7,7,7,7]
[null,80,21,6,6,6,6,6,6,6,6,6,6,6,6,6,6,6,6,6,6,6,6,6,6,6,6,6,6,6,6,6,6,5,5,5,5,5,5,5,5,5,5,5,5,5,5,5,5,5,5,5,5,5,5,5,7,7,7,7,7,7,7,7,7,7,7,7,7,7,7,7,7,7,7,7,7,7,7,7,7,7,7]
[null,81,20,6,6,6,6,6,6,6,6,6,6,6,6,6,6,6,6,6,6,6,6,6,6,6,6,6,6,6,6,6,6,6,5,5,5,5,5,5,5,5,5,5,5,5,5,5,5,5,5,5,5,5,5,5,5,7,7,7,7,7,7,7,7,7,7,7,7,7,7,7,7,7,7,7,7,7,7,7,7,7,7,7]
[null,82,19,6,6,6,6,6,6,6,6,6,6,6,6,6,6,6,6,6,6,6,6,6,6,6,6,6,6,6,6,6,6,6,6,5,5,5,5,5,5,5,5,5,5,5,5,5,5,5,5,5,5,5,5,5,5,4,4,4,4,4,4,4,4,4,4,4,4,4,4,4,4,4,4,4,4,4,4,4,4,4,4,4,4]
[null,83,18,6,6,6,6,6,6,6,6,6,6,6,6,6,6,6,6,6,6,6,6,6,6,6,6,6,6,6,6,6,6,6,6,6,5,5,5,5,5,5,5,5,5,5,5,5,5,5,5,5,5,5,5,5,5,4,4,4,4,4,4,4,4,4,4,4,4,4,4,4,4,4,4,4,4,4,4,4,4,4,4,4,4,4]
[null,84,17,6,6,6,6,6,6,6,6,6,6,6,6,6,6,6,6,6,6,6,6,6,6,6,6,6,6,6,6,6,6,6,6,6,6,5,5,5,5,5,5,5,5,5,5,5,5,5,5,5,5,5,5,5,5,4,4,4,4,4,4,4,4,4,4,4,4,4,4,4,4,4,4,4,4,4,4,4,4,4,4,4,4,4,4]
[null,85,16,6,6,6,6,6,6,6,6,6,6,6,6,6,6,6,6,6,6,6,6,6,6,6,6,6,6,6,6,6,6,6,6,6,6,6,5,5,5,5,5,5,5,5,5,5,5,5,5,5,5,5,5,5,5,4,4,4,4,4,4,4,4,4,4,4,4,4,4,4,4,4,4,4,4,4,4,4,4,4,4,4,4,4,4,4]
[null,86,15,6,6,6,6,6,6,6,6,6,6,6,6,6,6,6,6,6,6,6,6,6,6,6,6,6,6,6,6,6,6,6,6,6,6,6,6,5,5,5,5,5,5,5,5,5,5,5,5,5,5,5,5,5,5,4,4,4,4,4,4,4,4,4,4,4,4,4,4,4,4,4,4,4,4,4,4,4,4,4,4,4,4,4,4,2,2]
[null,87,14,6,6,6,6,6,6,6,6,6,6,6,6,6,6,6,6,6,6,6,6,6,6,6,6,6,6,6,6,6,6,6,6,6,6,6,6,5,5,5,5,5,5,5,5,5,5,5,5,5,5,5,5,5,5,4,4,4,4,4,4,4,4,4,4,4,4,4,4,4,4,4,4,4,4,4,4,4,4,4,4,4,4,4,2,2,2,2]
[null,88,13,6,6,6,6,6,6,6,6,6,6,6,6,6,6,6,6,6,6,6,6,6,6,6,6,6,6,6,6,6,6,6,6,6,6,6,6,6,6,5,5,5,5,5,5,5,5,5,5,5,5,5,5,5,5,4,4,4,4,4,4,4,4,4,4,4,4,4,4,4,4,4,4,4,4,4,4,4,4,4,4,4,4,2,2,2,2,2,2]
[null,89,12,3,3,3,3,3,3,3,3,3,6,6,6,6,6,6,6,6,6,6,6,6,6,6,6,6,6,6,6,6,6,6,6,6,6,6,6,6,6,6,5,5,5,5,5,5,5,5,5,5,5,5,5,5,5,4,4,4,4,4,4,4,4,4,4,4,4,4,4,4,4,4,4,4,4,4,4,4,4,4,4,4,2,2,2,2,2,2,2,2]
[null,90,11,3,3,3,3,3,3,3,3,3,3,6,6,6,6,6,6,6,6,6,6,6,6,6,6,6,6,6,6,6,6,6,6,6,6,6,6,6,6,6,6,5,5,5,5,5,5,5,5,5,5,5,5,5,5,4,4,4,4,4,4,4,4,4,4,4,4,4,4,4,4,4,4,4,4,4,4,4,4,4,4,4,2,2,2,2,2,2,2,2,2]
[null,91,10,3,3,3,3,3,3,3,3,3,3,3,6,6,6,6,6,6,6,6,6,6,6,6,6,6,6,6,6,6,6,6,6,6,6,6,6,6,6,6,6,6,5,5,5,5,5,5,5,5,5,5,5,5,5,4,4,4,4,4,4,4,4,4,4,4,4,4,4,4,4,4,4,4,4,4,4,4,4,4,4,2,2,2,2,2,2,2,2,2,2,1]
[null,92,9,3,3,3,3,3,3,3,3,3,3,3,3,6,6,6,6,6,6,6,6,6,6,6,6,6,6,6,6,6,6,6,6,6,6,6,6,6,6,6,6,6,6,5,5,5,5,5,5,5,5,5,5,5,5,4,4,4,4,4,4,4,4,4,4,4,4,4,4,4,4,4,4,4,4,4,4,4,4,4,2,2,2,2,2,2,2,2,2,2,1,1,1]
[null,93,8,3,3,3,3,3,3,3,3,3,3,3,3,3,6,6,6,6,6,6,6,6,6,6,6,6,6,6,6,6,6,6,6,6,6,6,6,6,6,6,6,6,6,6,5,5,5,5,5,5,5,5,5,5,5,4,4,4,4,4,4,4,4,4,4,4,4,4,4,4,4,4,4,4,4,4,4,4,4,2,2,2,2,2,2,2,2,2,2,2,1,1,1,1]
[null,94,7,3,3,3,3,3,3,3,3,3,3,3,3,3,3,6,6,6,6,6,6,6,6,6,6,6,6,6,6,6,6,6,6,6,6,6,6,6,6,6,6,6,6,6,6,4,4,4,4,4,4,4,4,4,4,4,4,4,4,4,4,4,4,4,4,4,4,4,4,4,4,4,4,4,4,4,4,4,2,2,2,2,2,2,2,2,2,2,2,1,1,1,1,1,1]
["A",95,6,3,3,3,3,3,3,3,3,3,3,3,3,3,3,3,6,6,6,6,6,6,6,6,6,6,6,6,6,6,6,6,6,6,6,6,6,6,6,6,6,6,6,6,6,6,4,4,4,4,4,4,4,4,4,4,4,4,4,4,4,4,4,4,4,4,4,4,4,4,4,4,4,4,4,4,4,2,2,2,2,2,2,2,2,2,2,2,2,1,1,1,1,1,1,1]
["L",96,5,3,3,3,3,3,3,3,3,3,3,3,3,3,3,3,3,6,6,6,6,6,6,6,6,6,6,6,6,6,6,6,6,6,6,6,6,6,6,6,6,6,6,6,6,6,6,4,4,4,4,4,4,4,4,4,4,4,4,4,4,4,4,4,4,4,4,4,4,4,4,4,4,4,4,4,2,2,2,2,2,2,2,2,2,2,2,2,1,1,1,1,1,1,1,1,1]
["L",97,4,3,3,3,3,3,3,3,3,3,3,3,3,3,3,3,3,3,6,6,6,6,6,6,6,6,6,6,6,6,6,6,6,6,6,6,6,6,6,6,6,6,6,6,6,6,6,6,4,4,4,4,4,4,4,4,4,4,4,4,4,4,4,4,4,4,4,4,4,4,4,4,4,4,4,2,2,2,2,2,2,2,2,2,2,2,2,2,1,1,1,1,1,1,1,1,1,1]
["I",98,3,3,3,3,3,3,3,3,3,3,3,3,3,3,3,3,3,3,3,6,6,6,6,6,6,6,6,6,6,6,6,6,6,6,6,6,6,6,6,6,6,6,6,6,6,6,6,6,6,4,4,4,4,4,4,4,4,4,4,4,4,4,4,4,4,4,4,4,4,4,4,4,4,4,2,2,2,2,2,2,2,2,2,2,2,2,2,1,1,1,1,1,1,1,1,1,1,1,1]
["G",99,2,3,3,3,3,3,3,3,3,3,3,3,3,3,3,3,3,3,3,3,6,6,6,6,6,6,6,6,6,6,6,6,6,6,6,6,6,6,6,6,6,6,6,6,6,6,6,6,6,6,4,4,4,4,4,4,4,4,4,4,4,4,4,4,4,4,4,4,4,4,4,4,4,2,2,2,2,2,2,2,2,2,2,2,2,2,2,1,1,1,1,1,1,1,1,1,1,1,1,1]
["R",100,1,3,3,3,3,3,3,3,3,3,3,3,3,3,3,3,3,3,3,3,3,6,6,6,6,6,6,6,6,6,6,6,6,6,6,6,6,6,6,6,6,6,6,6,6,6,6,6,6,6,6,4,4,4,4,4,4,4,4,4,4,4,4,4,4,4,4,4,4,4,4,4,4,2,2,2,2,2,2,2,2,2,2,2,2,2,1,1,1,1,1,1,1,1,1,1,1,1,1,1,1]
["A",101,0,3,3,3,3,3,3,3,3,3,3,3,3,3,3,3,3,3,3,3,3,3,6,6,6,6,6,6,6,6,6,6,6,6,6,6,6,6,6,6,6,6,6,6,6,6,6,6,6,6,6,6,4,4,4,4,4,4,4,4,4,4,4,4,4,4,4,4,4,4,4,4,2,2,2,2,2,2,2,2,2,2,2,2,2,2,1,1,1,1,1,1,1,1,1,1,1,1,1,1,1,1]
[null,"SABBIA",null,0,1,2,3,4,5,6,7,8,9,10,11,12,13,14,15,16,17,18,19,20,21,22,23,24,25,26,27,28,29,30,31,32,33,34,35,36,37,38,39,40,41,42,43,44,45,46,47,48,49,50,51,52,53,54,55,56,57,58,59,60,61,62,63,64,65,66,67,68,69,70,71,72,73,74,75,76,77,78,79,80,81,82,83,84,85,86,87,88,89,90,91,92,93,94,95,96,97,98,99,100]
["Colonna Matrice",null,null,1,{"$f":"(D105+1)","v":2},{"$f":"(E105+1)","v":3},4,5,6,7,8,9,10,11,12,13,14,15,16,17,18,19,20,21,22,23,24,25,26,27,28,29,30,31,32,33,34,35,36,37,38,39,40,41,42,43,44,45,46,47,48,49,50,51,52,53,54,55,56,57,58,59,60,61,62,63,64,65,66,{"$f":"(BQ105+1)","v":67},68,69,70,71,72,73,74,75,76,77,78,79,80,81,82,83,84,85,86,87,88,89,90,91,92,93,94,95,96,97,98,99,100,101]
[1,{"$f":"(A106+1)","v":2},{"$f":"(B106+1)","v":3},4,5,6,7,8,9,10,11,12,13,14,15,16,17,18,19,20,21,22,23,24,25,26,27,28,29,30,31,32,33,34,35,36,37,38,39,40,41,42,43,44,45,46,47,48,49,50,51,52,53,54,55,56,57,58,59,60,61,62,63,64,65,66,{"$f":"(BN106+1)","v":67},68,69,70,71,72,73,74,75,76,77,78,79,80,81,82,83,84,85,86,87,88,89,90,91,92,93,94,95,96,97,98,99,100,101,102,103,104]

{"sheet":"TRI3","index":40,"n_rows":106,"n_cols":104,"rows_kept":106,"cut":false,"hidden":true,"merged":[]}
[{"$f":"ADDRESS(Suolo!E23,Suolo!E24)","v":"$N$68"},"Riga Matrice","ARGILLA","I","D",null,"_",null,"S",null,"u",null,"o",null,"l",null,"o"]
[null,null,null,0,{"$f":"(D2+1)","v":1},{"$f":"(E2+1)","v":2},3,4,5,6,7,8,9,10,11,12,13,14,15,16,17,18,19,20,21,22,23,24,25,26,27,28,29,30,31,32,33,34,35,36,37,38,39,40,41,42,43,44,45,46,47,48,49,50,51,52,53,54,55,56,57,58,59,60,61,62,63,64,65,{"$f":"(BQ2+1)","v":66},67,68,69,70,71,72,73,74,75,76,77,78,79,80,81,82,83,84,85,86,87,88,89,90,91,92,93,94,95,96,97,98,99,100]
[null,1,100,"A"]
[null,{"$f":"(B3+1)","v":2},99,"A","A"]
[null,{"$f":"(B4+1)","v":3},98,"A","A","A"]
[null,4,97,"A","A","A","A"]
[null,5,96,"A","A","A","A","A"]
[null,6,95,"A","A","A","A","A","A"]
[null,7,94,"A","A","A","A","A","A","A"]
[null,8,93,"A","A","A","A","A","A","A","A"]
[null,9,92,"A","A","A","A","A","A","A","A","A"]
[null,10,91,"A","A","A","A","A","A","A","A","A","A"]
[null,11,90,"A","A","A","A","A","A","A","A","A","A","A"]
[null,12,89,"A","A","A","A","A","A","A","A","A","A","A","A"]
[null,13,88,"A","A","A","A","A","A","A","A","A","A","A","A","A"]
[null,14,87,"A","A","A","A","A","A","A","A","A","A","A","A","A","A"]
[null,15,86,"A","A","A","A","A","A","A","A","A","A","A","A","A","A","A"]
[null,16,85,"A","A","A","A","A","A","A","A","A","A","A","A","A","A","A","A"]
[null,17,84,"A","A","A","A","A","A","A","A","A","A","A","A","A","A","A","A","A"]
[null,18,83,"A","A","A","A","A","A","A","A","A","A","A","A","A","A","A","A","A","A"]
[null,19,82,"A","A","A","A","A","A","A","A","A","A","A","A","A","A","A","A","A","A","A"]
[null,20,81,"A","A","A","A","A","A","A","A","A","A","A","A","A","A","A","A","A","A","A","A"]
[null,21,80,"A","A","A","A","A","A","A","A","A","A","A","A","A","A","A","A","A","A","A","A","A"]
[null,22,79,"A","A","A","A","A","A","A","A","A","A","A","A","A","A","A","A","A","A","A","A","A","A"]
[null,23,78,"A","A","A","A","A","A","A","A","A","A","A","A","A","A","A","A","A","A","A","A","A","A","A"]
[null,24,77,"A","A","A","A","A","A","A","A","A","A","A","A","A","A","A","A","A","A","A","A","A","A","A","A"]
[null,25,76,"A","A","A","A","A","A","A","A","A","A","A","A","A","A","A","A","A","A","A","A","A","A","A","A","A"]
[null,26,75,"A","A","A","A","A","A","A","A","A","A","A","A","A","A","A","A","A","A","A","A","A","A","A","A","A","A"]
[null,27,74,"A","A","A","A","A","A","A","A","A","A","A","A","A","A","A","A","A","A","A","A","A","A","A","A","A","A","A"]
[null,28,73,"A","A","A","A","A","A","A","A","A","A","A","A","A","A","A","A","A","A","A","A","A","A","A","A","A","A","A","A"]
[null,29,72,"A","A","A","A","A","A","A","A","A","A","A","A","A","A","A","A","A","A","A","A","A","A","A","A","A","A","A","A","A"]
[null,30,71,"A","A","A","A","A","A","A","A","A","A","A","A","A","A","A","A","A","A","A","A","A","A","A","A","A","A","A","A","A","A"]
[null,31,70,"A","A","A","A","A","A","A","A","A","A","A","A","A","A","A","A","A","A","A","A","A","A","A","A","A","A","A","A","A","A","A"]
[null,32,69,"A","A","A","A","A","A","A","A","A","A","A","A","A","A","A","A","A","A","A","A","A","A","A","A","A","A","A","A","A","A","A","A"]
[null,33,68,"A","A","A","A","A","A","A","A","A","A","A","A","A","A","A","A","A","A","A","A","A","A","A","A","A","A","A","A","A","A","A","A","A"]
[null,34,67,"A","A","A","A","A","A","A","A","A","A","A","A","A","A","A","A","A","A","A","A","A","A","A","A","A","A","A","A","A","A","A","A","A","A"]
[null,35,66,"A","A","A","A","A","A","A","A","A","A","A","A","A","A","A","A","A","A","A","A","A","A","A","A","A","A","A","A","A","A","A","A","A","A","A"]
[null,36,65,"A","A","A","A","A","A","A","A","A","A","A","A","A","A","A","A","A","A","A","A","A","A","A","A","A","A","A","A","A","A","A","A","A","A","A","A"]
[null,37,64,"A","A","A","A","A","A","A","A","A","A","A","A","A","A","A","A","A","A","A","A","A","A","A","A","A","A","A","A","A","A","A","A","A","A","A","A","A"]
[null,38,63,"A","A","A","A","A","A","A","A","A","A","A","A","A","A","A","A","A","A","A","A","A","A","A","A","A","A","A","A","A","A","A","A","A","A","A","A","A","A"]
[null,39,62,"A","A","A","A","A","A","A","A","A","A","A","A","A","A","A","A","A","A","A","A","A","A","A","A","A","A","A","A","A","A","A","A","A","A","A","A","A","A","A"]
[null,40,61,"A","A","A","A","A","A","A","A","A","A","A","A","A","A","A","A","A","A","A","A","A","A","A","A","A","A","A","A","A","A","A","A","A","A","A","A","A","A","A","A"]
[null,41,60,"AL","A","A","A","A","A","A","A","A","A","A","A","A","A","A","A","A","A","A","A","A","A","A","A","A","A","A","A","A","A","A","A","A","A","A","A","A","A","A","A","A"]
[null,42,59,"AL","AL","A","A","A","A","A","A","A","A","A","A","A","A","A","A","A","A","A","A","A","A","A","A","A","A","A","A","A","A","A","A","A","A","A","A","A","A","A","A","A","A"]
[null,43,58,"AL","AL","AL","A","A","A","A","A","A","A","A","A","A","A","A","A","A","A","A","A","A","A","A","A","A","A","A","A","A","A","A","A","A","A","A","A","A","A","A","A","A","A","A"]
[null,44,57,"AL","AL","AL","AL","A","A","A","A","A","A","A","A","A","A","A","A","A","A","A","A","A","A","A","A","A","A","A","A","A","A","A","A","A","A","A","A","A","A","A","A","A","A","A","A"]
[null,45,56,"AL","AL","AL","AL","AL","A","A","A","A","A","A","A","A","A","A","A","A","A","A","A","A","A","A","A","A","A","A","A","A","A","A","A","A","A","A","A","A","A","A","A","A","A","A","A","A"]
[null,46,55,"AL","AL","AL","AL","AL","AL","A","A","A","A","A","A","A","A","A","A","A","A","A","A","A","A","A","A","A","A","A","A","A","A","A","A","A","A","A","A","A","A","A","A","A","A","A","A","A","A"]
[null,47,54,"AL","AL","AL","AL","AL","AL","AL","A","A","A","A","A","A","A","A","A","A","A","A","A","A","A","A","A","A","A","A","A","A","A","A","A","A","A","A","A","A","A","A","A","A","A","A","A","A","A","AS"]
[null,48,53,"AL","AL","AL","AL","AL","AL","AL","AL","A","A","A","A","A","A","A","A","A","A","A","A","A","A","A","A","A","A","A","A","A","A","A","A","A","A","A","A","A","A","A","A","A","A","A","A","A","A","AS","AS"]
[null,49,52,"AL","AL","AL","AL","AL","AL","AL","AL","AL","A","A","A","A","A","A","A","A","A","A","A","A","A","A","A","A","A","A","A","A","A","A","A","A","A","A","A","A","A","A","A","A","A","A","A","A","A","AS","AS","AS"]
[null,50,51,"AL","AL","AL","AL","AL","AL","AL","AL","AL","AL","A","A","A","A","A","A","A","A","A","A","A","A","A","A","A","A","A","A","A","A","A","A","A","A","A","A","A","A","A","A","A","A","A","A","A","A","AS","AS","AS","AS"]
[null,51,50,"AL","AL","AL","AL","AL","AL","AL","AL","AL","AL","AL","A","A","A","A","A","A","A","A","A","A","A","A","A","A","A","A","A","A","A","A","A","A","A","A","A","A","A","A","A","A","A","A","A","A","A","AS","AS","AS","AS","AS"]
[null,52,49,"AL","AL","AL","AL","AL","AL","AL","AL","AL","AL","AL","AL","A","A","A","A","A","A","A","A","A","A","A","A","A","A","A","A","A","A","A","A","A","A","A","A","A","A","A","A","A","A","A","A","A","A","AS","AS","AS","AS","AS","AS"]
[null,53,48,"AL","AL","AL","AL","AL","AL","AL","AL","AL","AL","AL","AL","AL","A","A","A","A","A","A","A","A","A","A","A","A","A","A","A","A","A","A","A","A","A","A","A","A","A","A","A","A","A","A","A","A","A","AS","AS","AS","AS","AS","AS","AS"]
[null,54,47,"AL","AL","AL","AL","AL","AL","AL","AL","AL","AL","AL","AL","AL","AL","A","A","A","A","A","A","A","A","A","A","A","A","A","A","A","A","A","A","A","A","A","A","A","A","A","A","A","A","A","A","A","A","AS","AS","AS","AS","AS","AS","AS","AS"]
[null,55,46,"AL","AL","AL","AL","AL","AL","AL","AL","AL","AL","AL","AL","AL","AL","AL","A","A","A","A","A","A","A","A","A","A","A","A","A","A","A","A","A","A","A","A","A","A","A","A","A","A","A","A","A","A","A","AS","AS","AS","AS","AS","AS","AS","AS","AS"]
[null,56,45,"AL","AL","AL","AL","AL","AL","AL","AL","AL","AL","AL","AL","AL","AL","AL","AL","A","A","A","A","A","A","A","A","A","A","A","A","A","A","A","A","A","A","A","A","A","A","A","A","A","A","A","A","A","A","AS","AS","AS","AS","AS","AS","AS","AS","AS","AS"]
[null,57,44,"AL","AL","AL","AL","AL","AL","AL","AL","AL","AL","AL","AL","AL","AL","AL","AL","AL","A","A","A","A","A","A","A","A","A","A","A","A","A","A","A","A","A","A","A","A","A","A","A","A","A","A","A","A","A","AS","AS","AS","AS","AS","AS","AS","AS","AS","AS","AS"]
[null,58,43,"AL","AL","AL","AL","AL","AL","AL","AL","AL","AL","AL","AL","AL","AL","AL","AL","AL","AL","A","A","A","A","A","A","A","A","A","A","A","A","A","A","A","A","A","A","A","A","A","A","A","A","A","A","A","A","AS","AS","AS","AS","AS","AS","AS","AS","AS","AS","AS","AS"]
[null,59,42,"AL","AL","AL","AL","AL","AL","AL","AL","AL","AL","AL","AL","AL","AL","AL","AL","AL","AL","AL","A","A","A","A","A","A","A","A","A","A","A","A","A","A","A","A","A","A","A","A","A","A","A","A","A","A","A","AS","AS","AS","AS","AS","AS","AS","AS","AS","AS","AS","AS","AS"]
[null,60,41,"AL","AL","AL","AL","AL","AL","AL","AL","AL","AL","AL","AL","AL","AL","AL","AL","AL","AL","AL","AL","A","A","A","A","A","A","A","A","A","A","A","A","A","A","A","A","A","A","A","A","A","A","A","A","A","A","AS","AS","AS","AS","AS","AS","AS","AS","AS","AS","AS","AS","AS","AS"]
[null,61,40,"FLA","FLA","FLA","FLA","FLA","FLA","FLA","FLA","FLA","FLA","FLA","FLA","FLA","FLA","FLA","FLA","FLA","FLA","FLA","FLA","FLA","FA","FA","FA","FA","FA","FA","FA","FA","FA","FA","FA","FA","FA","FA","FA","FA","FA","FA","FA","FA","FA","FA","FA","FA","FA","AS","AS","AS","AS","AS","AS","AS","AS","AS","AS","AS","AS","AS","AS","AS"]
[null,62,39,"FLA","FLA","FLA","FLA","FLA","FLA","FLA","FLA","FLA","FLA","FLA","FLA","FLA","FLA","FLA","FLA","FLA","FLA","FLA","FLA","FLA","FA","FA","FA","FA","FA","FA","FA","FA","FA","FA","FA","FA","FA","FA","FA","FA","FA","FA","FA","FA","FA","FA","FA","FA","FA","AS","AS","AS","AS","AS","AS","AS","AS","AS","AS","AS","AS","AS","AS","AS","AS"]
[null,63,38,"FLA","FLA","FLA","FLA","FLA","FLA","FLA","FLA","FLA","FLA","FLA","FLA","FLA","FLA","FLA","FLA","FLA","FLA","FLA","FLA","FLA","FA","FA","FA","FA","FA","FA","FA","FA","FA","FA","FA","FA","FA","FA","FA","FA","FA","FA","FA","FA","FA","FA","FA","FA","FA","AS","AS","AS","AS","AS","AS","AS","AS","AS","AS","AS","AS","AS","AS","AS","AS","AS"]
[null,64,37,"FLA","FLA","FLA","FLA","FLA","FLA","FLA","FLA","FLA","FLA","FLA","FLA","FLA","FLA","FLA","FLA","FLA","FLA","FLA","FLA","FLA","FA","FA","FA","FA","FA","FA","FA","FA","FA","FA","FA","FA","FA","FA","FA","FA","FA","FA","FA","FA","FA","FA","FA","FA","FA","AS","AS","AS","AS","AS","AS","AS","AS","AS","AS","AS","AS","AS","AS","AS","AS","AS","AS"]
[null,65,36,"FLA","FLA","FLA","FLA","FLA","FLA","FLA","FLA","FLA","FLA","FLA","FLA","FLA","FLA","FLA","FLA","FLA","FLA","FLA","FLA","FLA","FA","FA","FA","FA","FA","FA","FA","FA","FA","FA","FA","FA","FA","FA","FA","FA","FA","FA","FA","FA","FA","FA","FA","FA","FA","AS","AS","AS","AS","AS","AS","AS","AS","AS","AS","AS","AS","AS","AS","AS","AS","AS","AS","AS"]
[null,66,35,"FLA","FLA","FLA","FLA","FLA","FLA","FLA","FLA","FLA","FLA","FLA","FLA","FLA","FLA","FLA","FLA","FLA","FLA","FLA","FLA","FLA","FA","FA","FA","FA","FA","FA","FA","FA","FA","FA","FA","FA","FA","FA","FA","FA","FA","FA","FA","FA","FA","FA","FA","FA","FA","AS","AS","AS","AS","AS","AS","AS","AS","AS","AS","AS","AS","AS","AS","AS","AS","AS","AS","AS","AS"]
[null,{"$f":"(B68+1)","v":67},34,"FLA","FLA","FLA","FLA","FLA","FLA","FLA","FLA","FLA","FLA","FLA","FLA","FLA","FLA","FLA","FLA","FLA","FLA","FLA","FLA","FLA","FA","FA","FA","FA","FA","FA","FA","FA","FA","FA","FA","FA","FA","FA","FA","FA","FA","FA","FA","FA","FA","FA","FA","FA","FA","FSA","FSA","FSA","FSA","FSA","FSA","FSA","FSA","FSA","FSA","FSA","FSA","FSA","FSA","FSA","FSA","FSA","FSA","FSA","FSA","FSA"]
[null,68,33,"FLA","FLA","FLA","FLA","FLA","FLA","FLA","FLA","FLA","FLA","FLA","FLA","FLA","FLA","FLA","FLA","FLA","FLA","FLA","FLA","FLA","FA","FA","FA","FA","FA","FA","FA","FA","FA","FA","FA","FA","FA","FA","FA","FA","FA","FA","FA","FA","FA","FA","FA","FA","FA","FSA","FSA","FSA","FSA","FSA","FSA","FSA","FSA","FSA","FSA","FSA","FSA","FSA","FSA","FSA","FSA","FSA","FSA","FSA","FSA","FSA","FSA"]
[null,69,32,"FLA","FLA","FLA","FLA","FLA","FLA","FLA","FLA","FLA","FLA","FLA","FLA","FLA","FLA","FLA","FLA","FLA","FLA","FLA","FLA","FLA","FA","FA","FA","FA","FA","FA","FA","FA","FA","FA","FA","FA","FA","FA","FA","FA","FA","FA","FA","FA","FA","FA","FA","FA","FA","FSA","FSA","FSA","FSA","FSA","FSA","FSA","FSA","FSA","FSA","FSA","FSA","FSA","FSA","FSA","FSA","FSA","FSA","FSA","FSA","FSA","FSA","FSA"]
[null,70,31,"FLA","FLA","FLA","FLA","FLA","FLA","FLA","FLA","FLA","FLA","FLA","FLA","FLA","FLA","FLA","FLA","FLA","FLA","FLA","FLA","FLA","FA","FA","FA","FA","FA","FA","FA","FA","FA","FA","FA","FA","FA","FA","FA","FA","FA","FA","FA","FA","FA","FA","FA","FA","FA","FSA","FSA","FSA","FSA","FSA","FSA","FSA","FSA","FSA","FSA","FSA","FSA","FSA","FSA","FSA","FSA","FSA","FSA","FSA","FSA","FSA","FSA","FSA","FSA"]
[null,71,30,"FLA","FLA","FLA","FLA","FLA","FLA","FLA","FLA","FLA","FLA","FLA","FLA","FLA","FLA","FLA","FLA","FLA","FLA","FLA","FLA","FLA","FA","FA","FA","FA","FA","FA","FA","FA","FA","FA","FA","FA","FA","FA","FA","FA","FA","FA","FA","FA","FA","FA","FA","FA","FA","FSA","FSA","FSA","FSA","FSA","FSA","FSA","FSA","FSA","FSA","FSA","FSA","FSA","FSA","FSA","FSA","FSA","FSA","FSA","FSA","FSA","FSA","FSA","FSA","FSA"]
[null,72,29,"FLA","FLA","FLA","FLA","FLA","FLA","FLA","FLA","FLA","FLA","FLA","FLA","FLA","FLA","FLA","FLA","FLA","FLA","FLA","FLA","FLA","FA","FA","FA","FA","FA","FA","FA","FA","FA","FA","FA","FA","FA","FA","FA","FA","FA","FA","FA","FA","FA","FA","FA","FA","FA","FSA","FSA","FSA","FSA","FSA","FSA","FSA","FSA","FSA","FSA","FSA","FSA","FSA","FSA","FSA","FSA","FSA","FSA","FSA","FSA","FSA","FSA","FSA","FSA","FSA","FSA"]
[null,73,28,"FLA","FLA","FLA","FLA","FLA","FLA","FLA","FLA","FLA","FLA","FLA","FLA","FLA","FLA","FLA","FLA","FLA","FLA","FLA","FLA","FLA","FA","FA","FA","FA","FA","FA","FA","FA","FA","FA","FA","FA","FA","FA","FA","FA","FA","FA","FA","FA","FA","FA","FA","FA","FA","FSA","FSA","FSA","FSA","FSA","FSA","FSA","FSA","FSA","FSA","FSA","FSA","FSA","FSA","FSA","FSA","FSA","FSA","FSA","FSA","FSA","FSA","FSA","FSA","FSA","FSA","FSA"]
[null,74,27,"FL","FL","FL","FL","FL","FL","FL","FL","FL","FL","FL","FL","FL","FL","FL","FL","FL","FL","FL","FL","FL","FL","FL","FL","F","F","F","F","F","F","F","F","F","F","F","F","F","F","F","F","F","F","F","F","F","F","F","FSA","FSA","FSA","FSA","FSA","FSA","FSA","FSA","FSA","FSA","FSA","FSA","FSA","FSA","FSA","FSA","FSA","FSA","FSA","FSA","FSA","FSA","FSA","FSA","FSA","FSA","FSA"]
[null,75,26,"FL","FL","FL","FL","FL","FL","FL","FL","FL","FL","FL","FL","FL","FL","FL","FL","FL","FL","FL","FL","FL","FL","FL","FL","FL","F","F","F","F","F","F","F","F","F","F","F","F","F","F","F","F","F","F","F","F","F","F","F","FSA","FSA","FSA","FSA","FSA","FSA","FSA","FSA","FSA","FSA","FSA","FSA","FSA","FSA","FSA","FSA","FSA","FSA","FSA","FSA","FSA","FSA","FSA","FSA","FSA","FSA","FSA"]
[null,76,25,"FL","FL","FL","FL","FL","FL","FL","FL","FL","FL","FL","FL","FL","FL","FL","FL","FL","FL","FL","FL","FL","FL","FL","FL","FL","FL","F","F","F","F","F","F","F","F","F","F","F","F","F","F","F","F","F","F","F","F","F","F","F","FSA","FSA","FSA","FSA","FSA","FSA","FSA","FSA","FSA","FSA","FSA","FSA","FSA","FSA","FSA","FSA","FSA","FSA","FSA","FSA","FSA","FSA","FSA","FSA","FSA","FSA","FSA"]
[null,77,24,"FL","FL","FL","FL","FL","FL","FL","FL","FL","FL","FL","FL","FL","FL","FL","FL","FL","FL","FL","FL","FL","FL","FL","FL","FL","FL","FL","F","F","F","F","F","F","F","F","F","F","F","F","F","F","F","F","F","F","F","F","F","F","F","FSA","FSA","FSA","FSA","FSA","FSA","FSA","FSA","FSA","FSA","FSA","FSA","FSA","FSA","FSA","FSA","FSA","FSA","FSA","FSA","FSA","FSA","FSA","FSA","FSA","FSA","FSA"]
[null,78,23,"FL","FL","FL","FL","FL","FL","FL","FL","FL","FL","FL","FL","FL","FL","FL","FL","FL","FL","FL","FL","FL","FL","FL","FL","FL","FL","FL","FL","F","F","F","F","F","F","F","F","F","F","F","F","F","F","F","F","F","F","F","F","F","F","F","FSA","FSA","FSA","FSA","FSA","FSA","FSA","FSA","FSA","FSA","FSA","FSA","FSA","FSA","FSA","FSA","FSA","FSA","FSA","FSA","FSA","FSA","FSA","FSA","FSA","FSA","FSA"]
[null,79,22,"FL","FL","FL","FL","FL","FL","FL","FL","FL","FL","FL","FL","FL","FL","FL","FL","FL","FL","FL","FL","FL","FL","FL","FL","FL","FL","FL","FSS","FL","F","F","F","F","F","F","F","F","F","F","F","F","F","F","F","F","F","F","F","F","F","F","F","FSA","FSA","FSA","FSA","FSA","FSA","FSA","FSA","FSA","FSA","FSA","FSA","FSA","FSA","FSA","FSA","FSA","FSA","FSA","FSA","FSA","FSA","FSA","FSA","FSA","FSA","FSA"]
[null,80,21,"FL","FL","FL","FL","FL","FL","FL","FL","FL","FL","FL","FL","FL","FL","FL","FL","FL","FL","FL","FL","FL","FL","FL","FL","FL","FL","FL","FL","FL","FL","F","F","F","F","F","F","F","F","F","F","F","F","F","F","F","F","F","F","F","F","F","F","F","FSA","FSA","FSA","FSA","FSA","FSA","FSA","FSA","FSA","FSA","FSA","FSA","FSA","FSA","FSA","FSA","FSA","FSA","FSA","FSA","FSA","FSA","FSA","FSA","FSA","FSA","FSA"]
[null,81,20,"FL","FL","FL","FL","FL","FL","FL","FL","FL","FL","FL","FL","FL","FL","FL","FL","FL","FL","FL","FL","FL","FL","FL","FL","FL","FL","FL","FL","FL","FL","FL","F","F","F","F","F","F","F","F","F","F","F","F","F","F","F","F","F","F","F","F","F","F","F","FSA","FSA","FSA","FSA","FSA","FSA","FSA","FSA","FSA","FSA","FSA","FSA","FSA","FSA","FSA","FSA","FSA","FSA","FSA","FSA","FSA","FSA","FSA","FSA","FSA","FSA","FSA"]
[null,82,19,"FL","FL","FL","FL","FL","FL","FL","FL","FL","FL","FL","FL","FL","FL","FL","FL","FL","FL","FL","FL","FL","FL","FL","FL","FL","FL","FL","FL","FL","FL","FL","FL","F","F","F","F","F","F","F","F","F","F","F","F","F","F","F","F","F","F","F","F","F","F","FS","FS","FS","FS","FS","FS","FS","FS","FS","FS","FS","FS","FS","FS","FS","FS","FS","FS","FS","FS","FS","FS","FS","FS","FS","FS","FS","FS"]
[null,83,18,"FL","FL","FL","FL","FL","FL","FL","FL","FL","FL","FL","FL","FL","FL","FL","FL","FL","FL","FL","FL","FL","FL","FL","FL","FL","FL","FL","FL","FL","FL","FL","FL","FL","F","F","F","F","F","F","F","F","F","F","F","F","F","F","F","F","F","F","F","F","F","FS","FS","FS","FS","FS","FS","FS","FS","FS","FS","FS","FS","FS","FS","FS","FS","FS","FS","FS","FS","FS","FS","FS","FS","FS","FS","FS","FS","FS"]
[null,84,17,"FL","FL","FL","FL","FL","FL","FL","FL","FL","FL","FL","FL","FL","FL","FL","FL","FL","FL","FL","FL","FL","FL","FL","FL","FL","FL","FL","FL","FL","FL","FL","FL","FL","FL","F","F","F","F","F","F","F","F","F","F","F","F","F","F","F","F","F","F","F","F","FS","FS","FS","FS","FS","FS","FS","FS","FS","FS","FS","FS","FS","FS","FS","FS","FS","FS","FS","FS","FS","FS","FS","FS","FS","FS","FS","FS","FS","FS"]
[null,85,16,"FL","FL","FL","FL","FL","FL","FL","FL","FL","FL","FL","FL","FL","FL","FL","FL","FL","FL","FL","FL","FL","FL","FL","FL","FL","FL","FL","FL","FL","FL","FL","FL","FL","FL","FL","F","F","F","F","F","F","F","F","F","F","F","F","F","F","F","F","F","F","F","FS","FS","FS","FS","FS","FS","FS","FS","FS","FS","FS","FS","FS","FS","FS","FS","FS","FS","FS","FS","FS","FS","FS","FS","FS","FS","FS","FS","FS","FS","FS"]
[null,86,15,"FL","FL","FL","FL","FL","FL","FL","FL","FL","FL","FL","FL","FL","FL","FL","FL","FL","FL","FL","FL","FL","FL","FL","FL","FL","FL","FL","FL","FL","FL","FL","FL","FL","FL","FL","FL","F","F","F","F","F","F","F","F","F","F","F","F","F","F","F","F","F","F","FS","FS","FS","FS","FS","FS","FS","FS","FS","FS","FS","FS","FS","FS","FS","FS","FS","FS","FS","FS","FS","FS","FS","FS","FS","FS","FS","FS","FS","FS","SF","SF"]
[null,87,14,"FL","FL","FL","FL","FL","FL","FL","FL","FL","FL","FL","FL","FL","FL","FL","FL","FL","FL","FL","FL","FL","FL","FL","FL","FL","FL","FL","FL","FL","FL","FL","FL","FL","FL","FL","FL","FS","F","F","F","F","F","F","F","F","F","F","F","F","F","F","F","F","F","FS","FS","FS","FS","FS","FS","FS","FS","FS","FS","FS","FS","FS","FS","FS","FS","FS","FS","FS","FS","FS","FS","FS","FS","FS","FS","FS","FS","FS","SF","SF","SF","SF"]
[null,88,13,"FL","FL","FL","FL","FL","FL","FL","FL","FL","FL","FL","FL","FL","FL","FL","FL","FL","FL","FL","FL","FL","FL","FL","FL","FL","FL","FL","FL","FL","FL","FL","FL","FL","FL","FL","FL","FL","FL","F","F","F","F","F","F","F","F","F","F","F","F","F","F","F","F","FS","FS","FS","FS","FS","FS","FS","FS","FS","FS","FS","FS","FS","FS","FS","FS","FS","FS","FS","FS","FS","FS","FS","FS","FS","FS","FS","FS","SF","SF","SF","SF","SF","SF"]
[null,89,12,"L","L","L","L","L","L","L","L","L","FL","FL","FL","FL","FL","FL","FL","FL","FL","FL","FL","FL","FL","FL","FL","FL","FL","FL","FL","FL","FL","FL","FL","FL","FL","FL","FL","FL","FL","FL","F","F","F","F","F","F","F","F","F","F","F","F","F","F","F","FS","FS","FS","FS","FS","FS","FS","FS","FS","FS","FS","FS","FS","FS","FS","FS","FS","FS","FS","FS","FS","FS","FS","FS","FS","FS","FS","SF","SF","SF","SF","SF","SF","SF","SF"]
[null,90,11,"L","L","L","L","L","L","L","L","L","L","FL","FL","FL","FL","FL","FL","FL","FL","FL","FL","FL","FL","FL","FL","FL","FL","FL","FL","FL","FL","FL","FL","FL","FL","FL","FL","FL","FL","FL","FL","F","F","F","F","F","F","F","F","F","F","F","F","F","F","FS","FS","FS","FS","FS","FS","FS","FS","FS","FS","FS","FS","FS","FS","FS","FS","FS","FS","FS","FS","FS","FS","FS","FS","FS","FS","FS","SF","SF","SF","SF","SF","SF","SF","SF","SF"]
[null,91,10,"L","L","L","L","L","L","L","L","L","L","L","FL","FL","FL","FL","FL","FL","FL","FL","FL","FL","FL","FL","FL","FL","FL","FL","FL","FL","FL","FL","FL","FL","FL","FL","FL","FL","FL","FL","FL","FL","F","F","F","F","F","F","F","F","F","F","F","F","F","FS","FS","FS","FS","FS","FS","FS","FS","FS","FS","FS","FS","FS","FS","FS","FS","FS","FS","FS","FS","FS","FS","FS","FS","FS","FS","SF","SF","SF","SF","SF","SF","SF","SF","SF","SF","S"]
[null,92,9,"L","L","L","L","L","L","L","L","L","L","L","L","FL","FL","FL","FL","FL","FL","FL","FL","FL","FL","FL","FL","FL","FL","FL","FL","FL","FL","FL","FL","FL","FL","FL","FL","FL","FL","FL","FL","FL","FL","F","F","F","F","F","F","F","F","F","F","F","F","FS","FS","FS","FS","FS","FS","FS","FS","FS","FS","FS","FS","FS","FS","FS","FS","FS","FS","FS","FS","FS","FS","FS","FS","FS","SF","SF","SF","SF","SF","SF","SF","SF","SF","SF","S","S","S"]
[null,93,8,"L","L","L","L","L","L","L","L","L","L","L","L","L","FL","FL","FL","FL","FL","FL","FL","FL","FL","FL","FL","FL","FL","FL","FL","FL","FL","FL","FL","FL","FL","FL","FL","FL","FL","FL","FL","FL","FL","FL","F","F","F","F","F","F","F","F","F","F","F","FS","FS","FS","FS","FS","FS","FS","FS","FS","FS","FS","FS","FS","FS","FS","FS","FS","FS","FS","FS","FS","FS","FS","FS","SF","SF","SF","SF","SF","SF","SF","SF","SF","SF","SF","S","S","S","S"]
[null,94,7,"L","L","L","L","L","L","L","L","L","L","L","L","L","L","FL","FL","FL","FL","FL","FL","FL","FL","FL","FL","FL","FL","FL","FL","FL","FL","FL","FL","FL","FL","FL","FL","FL","FL","FL","FL","FL","FL","FL","FL","FS","FS","FS","FS","FS","FS","FS","FS","FS","FS","FS","FS","FS","FS","FS","FS","FS","FS","FS","FS","FS","FS","FS","FS","FS","FS","FS","FS","FS","FS","FS","FS","FS","SF","SF","SF","SF","SF","SF","SF","SF","SF","SF","SF","S","S","S","S","S","S"]
["A",95,6,"L","L","L","L","L","L","L","L","L","L","L","L","L","L","L","FL","FL","FL","FL","FL","FL","FL","FL","FL","FL","FL","FL","FL","FL","FL","FL","FL","FL","FL","FL","FL","FL","FL","FL","FL","FL","FL","FL","FL","FL","FS","FS","FS","FS","FS","FS","FS","FS","FS","FS","FS","FS","FS","FS","FS","FS","FS","FS","FS","FS","FS","FS","FS","FS","FS","FS","FS","FS","FS","FS","FS","SF","SF","SF","SF","SF","SF","SF","SF","SF","SF","SF","SF","S","S","S","S","S","S","S"]
["L",96,5,"L","L","L","L","L","L","L","L","L","L","L","L","L","L","L","L","FL","FL","FL","FL","FL","FL","FL","FL","FL","FL","FL","FL","FL","FL","FL","FL","FL","FL","FL","FL","FL","FL","FL","FL","FL","FL","FL","FL","FL","FL","FS","FS","FS","FS","FS","FS","FS","FS","FS","FS","FS","FS","FS","FS","FS","FS","FS","FS","FS","FS","FS","FS","FS","FS","FS","FS","FS","FS","FS","SF","SF","SF","SF","SF","SF","SF","SF","SF","SF","SF","SF","S","S","S","S","S","S","S","S","S"]
["L",97,4,"L","L","L","L","L","L","L","L","L","L","L","L","L","L","L","L","L","FL","FL","FL","FL","FL","FL","FL","FL","FL","FL","FL","FL","FL","FL","FL","FL","FL","FL","FL","FL","FL","FL","FL","FL","FL","FL","FL","FL","FL","FL","FS","FS","FS","FS","FS","FS","FS","FS","FS","FS","FS","FS","FS","FS","FS","FS","FS","FS","FS","FS","FS","FS","FS","FS","FS","FS","FS","SF","SF","SF","SF","SF","SF","SF","SF","SF","SF","SF","SF","SF","S","S","S","S","S","S","S","S","S","S"]
["I",98,3,"L","L","L","L","L","L","L","L","L","L","L","L","L","L","L","L","L","L","FL","FL","FL","FL","FL","FL","FL","FL","FL","FL","FL","FL","FL","FL","FL","FL","FL","FL","FL","FL","FL","FL","FL","FL","FL","FL","FL","FL","FL","FL","FS","FS","FS","FS","FS","FS","FS","FS","FS","FS","FS","FS","FS","FS","FS","FS","FS","FS","FS","FS","FS","FS","FS","FS","FS","SF","SF","SF","SF","SF","SF","SF","SF","SF","SF","SF","SF","SF","S","S","S","S","S","S","S","S","S","S","S","S"]
["G",99,2,"L","L","L","L","L","L","L","L","L","L","L","L","L","L","L","L","L","L","L","FL","FL","FL","FL","FL","FL","FL","FL","FL","FL","FL","FL","FL","FL","FL","FL","FL","FL","FL","FL","FL","FL","FL","FL","FL","FL","FL","FL","FL","FL","FS","FS","FS","FS","FS","FS","FS","FS","FS","FS","FS","FS","FS","FS","FS","FS","FS","FS","FS","FS","FS","FS","FS","SF","SF","SF","SF","SF","SF","SF","SF","SF","SF","SF","SF","SF","SF","S","S","S","S","S","S","S","S","S","S","S","S","S"]
["R",100,1,"L","L","L","L","L","L","L","L","L","L","L","L","L","L","L","L","L","L","L","L","FL","FL","FL","FL","FL","FL","FL","FL","FL","FL","FL","FL","FL","FL","FL","FL","FL","FL","FL","FL","FL","FL","FL","FL","FL","FL","FL","FL","FL","FL","FS","FS","FS","FS","FS","FS","FS","FS","FS","FS","FS","FS","FS","FS","FS","FS","FS","FS","FS","FS","FS","FS","SF","SF","SF","SF","SF","SF","SF","SF","SF","SF","SF","SF","SF","S","S","S","S","S","S","S","S","S","S","S","S","S","S","S"]
["A",101,0,"L","L","L","L","L","L","L","L","L","L","L","L","L","L","L","L","L","L","L","L","L","FL","FL","FL","FL","FL","FL","FL","FL","FL","FL","FL","FL","FL","FL","FL","FL","FL","FL","FL","FL","FL","FL","FL","FL","FL","FL","FL","FL","FL","FL","FS","FS","FS","FS","FS","FS","FS","FS","FS","FS","FS","FS","FS","FS","FS","FS","FS","FS","FS","FS","SF","SF","SF","SF","SF","SF","SF","SF","SF","SF","SF","SF","SF","SF","S","S","S","S","S","S","S","S","S","S","S","S","S","S","S","S"]
[null,"SABBIA",null,0,1,2,3,4,5,6,7,8,9,10,11,12,13,14,15,16,17,18,19,20,21,22,23,24,25,26,27,28,29,30,31,32,33,34,35,36,37,38,39,40,41,42,43,44,45,46,47,48,49,50,51,52,53,54,55,56,57,58,59,60,61,62,63,64,65,66,67,68,69,70,71,72,73,74,75,76,77,78,79,80,81,82,83,84,85,86,87,88,89,90,91,92,93,94,95,96,97,98,99,100]
["Colonna Matrice",null,null,1,{"$f":"(D105+1)","v":2},{"$f":"(E105+1)","v":3},4,5,6,7,8,9,10,11,12,13,14,15,16,17,18,19,20,21,22,23,24,25,26,27,28,29,30,31,32,33,34,35,36,37,38,39,40,41,42,43,44,45,46,47,48,49,50,51,52,53,54,55,56,57,58,59,60,61,62,63,64,65,66,{"$f":"(BQ105+1)","v":67},68,69,70,71,72,73,74,75,76,77,78,79,80,81,82,83,84,85,86,87,88,89,90,91,92,93,94,95,96,97,98,99,100,101]
[1,{"$f":"(A106+1)","v":2},{"$f":"(B106+1)","v":3},4,5,6,7,8,9,10,11,12,13,14,15,16,17,18,19,20,21,22,23,24,25,26,27,28,29,30,31,32,33,34,35,36,37,38,39,40,41,42,43,44,45,46,47,48,49,50,51,52,53,54,55,56,57,58,59,60,61,62,63,64,65,66,{"$f":"(BN106+1)","v":67},68,69,70,71,72,73,74,75,76,77,78,79,80,81,82,83,84,85,86,87,88,89,90,91,92,93,94,95,96,97,98,99,100,101,102,103,104]

{"sheet":"SO","index":41,"n_rows":18,"n_cols":6,"rows_kept":18,"cut":false,"hidden":true,"merged":[]}
[null,null,null,null,"Apporto massimo annuale di SO"]
["Dotazione di SO (%)"]
["ID_SO","Raggruppamento","Dotazione Giudizio","Dotazione classe","Dotazione terreno in S.O.","Apporto massimo"]
[1,"Sabbiosi","molto bassa","Scarsa","classe","t ss/ha"]
[2,"Sabbiosi","bassa","Scarsa","Elevata",9]
[3,"Sabbiosi","media","Normale","Normale",11]
[4,"Sabbiosi","elevata","Elevata","Scarsa",13]
[5,"Medio impasto","molto bassa","Scarsa"]
[6,"Medio impasto","bassa","Scarsa","Quantità max",{"$f":"VLOOKUP(D18,E5:F7,2)","v":13}]
[7,"Medio impasto","media","Normale"]
[8,"Medio impasto","elevata","Elevata"]
[9,"Argillosi e limosi","molto bassa","Scarsa"]
[10,"Argillosi e limosi","bassa","Scarsa"]
[11,"Argillosi e limosi","media","Normale"]
[12,"Argillosi e limosi","elevata","Elevata"]
[]
["ID_SO","Raggruppamento","Dotazione Giudizio","Dotazione classe"]
[{"$f":"B!A19","v":10},{"$f":"B!B19","v":"Argillosi e limosi"},{"$f":"B!E19","v":"bassa"},{"$f":"DGET(A3:D15,D3,A17:C18)","v":"Scarsa"}]